program: Orca
programVersion: 5.0.2
elementType: O O O N N C C C C C C C C C C C C H H H H H H H H H H H H H H H H
charge: 0
multiplicity: 1
keywords: wb97x-d3
keywords: def2-TZVPP
keywords: def2/J RIJCOSX
keywords: DEFGRID2
keywords: scfconv7
keywords: smallprint printgap noloewdin
keywords: NOSOSCF
formula: C12H16N2O3
InChI: InChI=1/C12H16N2O3/c1-3-13-11(15)9(2)17-12(16)14-10-7-5-4-6-8-10/h4-9,13-14H,3H2,1-2H3
33 atoms
O  -0.90706 -0.64152 0.260467
O  -4.341247 -0.106359 -0.338182
O  0.347276 -1.113576 -1.555686
N  -2.682477 1.295996 0.2845
N  1.250153 -0.284238 0.37993
C  -2.129644 -0.980521 -0.391776
C  -3.152851 0.117404 -0.120479
C  -2.598964 -2.337788 0.089438
C  -3.532042 2.428988 0.596907
C  2.61705 -0.199214 0.095632
C  -4.013836 2.434285 2.035417
C  0.247308 -0.71683 -0.415597
C  3.449555 0.138018 1.165658
C  3.18042 -0.404946 -1.163292
C  4.815312 0.264648 0.984618
C  4.553964 -0.278224 -1.327711
C  5.380948 0.055365 -0.266438
H  -2.790222 -2.340103 1.162661
H  -1.842767 -3.090943 -0.130759
H  -3.511793 -2.630667 -0.424725
H  -2.957709 3.33015 0.391137
H  -4.377848 2.43574 -0.087586
H  -1.703507 1.377914 0.508454
H  -4.605832 1.547477 2.260064
H  -3.17702 2.470771 2.732392
H  -4.637726 3.309737 2.217334
H  0.987293 -0.017625 1.319365
H  3.020498 0.302909 2.147319
H  2.573889 -0.657658 -2.017378
H  5.438194 0.527658 1.829433
H  4.975689 -0.441668 -2.310969
H  6.448477 0.152754 -0.410674
H  -1.984073 -1.006501 -1.475579
elementType: O N C H
totalener: -802.24518232 hartree
nucrepener: 1174.68912875 hartree
electener: -1976.93431107 hartree
oneelecener: -3422.43971202 hartree
twoeener: 1445.50540094 hartree
cpcmener: -0.04391279 hartree
kineticenergy: 798.77346485 hartree
xcener: -76.504034924799 hartree
chargesum: 0.0000000
charge: -0.343187 -0.581750 -0.519351 -0.186576 -0.151267 0.172903 0.342105 -0.270394 -0.007377 0.202069 -0.248580 0.553074 -0.235010 -0.247799 -0.116748 -0.138635 -0.203566 0.102447 0.103341 0.093664 0.098185 0.082162 0.184569 0.083999 0.085297 0.090851 0.176029 0.143786 0.156559 0.160831 0.160439 0.160800 0.097129
qa: -0.3432 -0.5817 -0.5194 -0.1866 -0.1513 0.1729 0.3421 -0.2704 -0.0074 0.2021 -0.2486 0.5531 -0.2350 -0.2478 -0.1167 -0.1386 -0.2036 0.1024 0.1033 0.0937 0.0982 0.0822 0.1846 0.0840 0.0853 0.0909 0.1760 0.1438 0.1566 0.1608 0.1604 0.1608 0.0971
va: 2.0730 1.9255 1.9872 3.2370 3.2590 3.8081 4.1715 3.9500 3.8605 3.7789 3.9214 4.2309 3.9324 3.9493 3.8849 3.9054 3.9126 1.0033 1.0079 1.0226 1.0005 1.0176 1.0125 1.0088 1.0045 1.0071 1.0180 1.0075 1.0305 0.9892 0.9909 0.9901 1.0310
dispcorr: -0.012310700 hartree
energy: -802.257493023700
dipole: -7.67156 9.29609 1.62453 5.17965 -3.74264 1.43700 6.80846 -4.79783 2.01063
magnitude: 2.95748 au
magnitude: 7.51732 debye
