program: Orca
programVersion: 5.0.2
elementType: O O O N N C C C C C C C C C C C C H H H H H H H H H H H H H H H H
charge: 0
multiplicity: 1
keywords: wb97x-d3
keywords: def2-TZVPP
keywords: def2/J RIJCOSX
keywords: DEFGRID2
keywords: scfconv7
keywords: smallprint printgap noloewdin
keywords: NOSOSCF
formula: C12H16N2O3
InChI: InChI=1/C12H16N2O3/c1-3-13-11(15)9(2)17-12(16)14-10-7-5-4-6-8-10/h4-9,13-14H,3H2,1-2H3
33 atoms
O  -0.917762 -1.099847 0.3625
O  -4.034354 0.073608 -0.906462
O  0.175516 -0.520682 -1.526894
N  -2.661058 0.909418 0.6834
N  1.203605 -0.560555 0.520167
C  -2.158286 -1.256603 -0.323232
C  -3.022527 -0.006819 -0.212746
C  -2.872186 -2.445946 0.292045
C  -3.406001 2.133941 0.909844
C  2.529737 -0.225937 0.223284
C  -3.068922 3.239134 -0.075583
C  0.163543 -0.705648 -0.329771
C  3.065714 -0.186498 -1.063417
C  3.358012 0.049927 1.313665
C  4.408004 0.126017 -1.237239
C  4.693751 0.358399 1.124193
C  5.230911 0.399795 -0.155754
H  -2.274308 -3.348492 0.170842
H  -3.823809 -2.608425 -0.210136
H  -3.066398 -2.291964 1.353735
H  -4.472704 1.909866 0.880816
H  -3.183256 2.458047 1.925693
H  -1.805013 0.782378 1.200136
H  -3.297692 2.945873 -1.100627
H  -3.651403 4.13172 0.15498
H  -2.013032 3.507403 -0.024384
H  0.99996 -0.697157 1.501301
H  2.463865 -0.402797 -1.930812
H  2.950904 0.018819 2.317709
H  4.80998 0.148997 -2.241829
H  5.315655 0.567197 1.984734
H  6.274915 0.639563 -0.306468
H  -1.987063 -1.44274 -1.384644
elementType: O N C H
totalener: -802.24607154 hartree
nucrepener: 1185.56984120 hartree
electener: -1987.81591273 hartree
oneelecener: -3444.44526606 hartree
twoeener: 1456.62935332 hartree
cpcmener: -0.04559840 hartree
kineticenergy: 798.75166956 hartree
xcener: -76.498842422305 hartree
chargesum: -0.0000000
charge: -0.341717 -0.582451 -0.518917 -0.180955 -0.149260 0.170600 0.344286 -0.263283 -0.014364 0.201477 -0.246620 0.534500 -0.245220 -0.232751 -0.139115 -0.117960 -0.201758 0.103326 0.098996 0.102705 0.082731 0.099329 0.184624 0.083248 0.091151 0.084354 0.177793 0.156095 0.143595 0.160009 0.160892 0.160787 0.093873
qa: -0.3417 -0.5825 -0.5189 -0.1810 -0.1493 0.1706 0.3443 -0.2633 -0.0144 0.2015 -0.2466 0.5345 -0.2452 -0.2328 -0.1391 -0.1180 -0.2018 0.1033 0.0990 0.1027 0.0827 0.0993 0.1846 0.0832 0.0912 0.0844 0.1778 0.1561 0.1436 0.1600 0.1609 0.1608 0.0939
va: 2.0757 1.9276 1.9833 3.2251 3.2562 3.8188 4.1404 3.9319 3.8668 3.7697 3.9030 4.2496 3.9510 3.9379 3.9092 3.8850 3.9120 1.0075 1.0173 1.0061 1.0135 1.0010 1.0126 1.0118 1.0072 1.0058 1.0170 1.0290 1.0075 0.9911 0.9891 0.9899 1.0437
dispcorr: -0.012548147 hartree
energy: -802.258619683616
dipole: -6.64402 8.07575 1.43173 5.63382 -5.46081 0.17301 4.40727 -1.40818 2.99909
magnitude: 3.32781 au
magnitude: 8.45863 debye
