program: Orca
programVersion: 5.0.2
elementType: O O O N N C C C C C C C C C C C C H H H H H H H H H H H H H H H H
charge: 0
multiplicity: 1
keywords: wb97x-d3
keywords: def2-TZVPP
keywords: def2/J RIJCOSX
keywords: DEFGRID2
keywords: scfconv7
keywords: smallprint printgap noloewdin
keywords: NOSOSCF
formula: C12H16N2O3
InChI: InChI=1/C12H16N2O3/c1-3-13-11(15)9(2)17-12(16)14-10-7-5-4-6-8-10/h4-9,13-14H,3H2,1-2H3
33 atoms
O  -0.97361 -1.473133 0.282905
O  -3.663059 0.247888 -1.232418
O  -0.154904 -0.112552 -1.310317
N  -2.628934 0.686098 0.73531
N  1.147988 -0.903483 0.403424
C  -2.249491 -1.454516 -0.35847
C  -2.891899 -0.071206 -0.331208
C  -3.123075 -2.464809 0.357288
C  -3.047939 2.067491 0.870985
C  2.399325 -0.326671 0.158969
C  -1.946145 3.040187 0.491382
C  0.006312 -0.767003 -0.302095
C  2.678615 0.553177 -0.886221
C  3.420346 -0.672767 1.046886
C  3.962736 1.065033 -1.025279
C  4.69395 -0.153947 0.895093
C  4.976932 0.721058 -0.145331
H  -4.109626 -2.484298 -0.103797
H  -3.243559 -2.221554 1.412622
H  -2.698247 -3.464452 0.273055
H  -3.930714 2.226175 0.255605
H  -3.354344 2.228415 1.904808
H  -1.956515 0.353832 1.411799
H  -1.067388 2.905062 1.123387
H  -1.640733 2.904366 -0.546828
H  -2.289935 4.067739 0.613166
H  1.099596 -1.504065 1.215892
H  1.920172 0.84934 -1.591981
H  3.211672 -1.354792 1.86278
H  4.163733 1.746631 -1.841579
H  5.46776 -0.438329 1.596026
H  5.971942 1.127523 -0.266541
H  -2.143676 -1.740989 -1.407063
elementType: O N C H
totalener: -802.24580520 hartree
nucrepener: 1206.96476590 hartree
electener: -2009.21057110 hartree
oneelecener: -3487.57950562 hartree
twoeener: 1478.36893451 hartree
cpcmener: -0.04732656 hartree
kineticenergy: 798.76357519 hartree
xcener: -76.500492847594 hartree
chargesum: -0.0000000
charge: -0.334128 -0.564527 -0.515128 -0.185729 -0.139714 0.169386 0.318154 -0.272470 -0.003331 0.200494 -0.257337 0.524427 -0.249686 -0.233300 -0.138306 -0.116081 -0.203554 0.102552 0.103768 0.105993 0.081049 0.097862 0.180471 0.086028 0.086075 0.095978 0.174546 0.158820 0.143795 0.159967 0.160908 0.161284 0.101734
qa: -0.3341 -0.5645 -0.5151 -0.1857 -0.1397 0.1694 0.3182 -0.2725 -0.0033 0.2005 -0.2573 0.5244 -0.2497 -0.2333 -0.1383 -0.1161 -0.2036 0.1026 0.1038 0.1060 0.0810 0.0979 0.1805 0.0860 0.0861 0.0960 0.1745 0.1588 0.1438 0.1600 0.1609 0.1613 0.1017
va: 2.0817 1.9466 1.9827 3.2100 3.2625 3.7637 4.1251 3.9586 3.8506 3.7879 3.9219 4.2512 3.9435 3.9302 3.9051 3.8847 3.9125 1.0098 1.0060 1.0063 1.0258 0.9999 1.0105 1.0035 1.0062 1.0089 1.0196 1.0306 1.0075 0.9912 0.9890 0.9898 1.0367
dispcorr: -0.013273644 hartree
energy: -802.259078846743
dipole: -4.68866 6.03569 1.34703 4.90636 -5.74659 -0.84023 5.83589 -2.73390 3.10200
magnitude: 3.48466 au
magnitude: 8.85731 debye
