program: Orca
programVersion: 5.0.2
elementType: O O O N N C C C C C C C C C C C C H H H H H H H H H H H H H H H H
charge: 0
multiplicity: 1
keywords: wb97x-d3
keywords: def2-TZVPP
keywords: def2/J RIJCOSX
keywords: DEFGRID2
keywords: scfconv7
keywords: smallprint printgap noloewdin
keywords: NOSOSCF
formula: C12H16N2O3
InChI: InChI=1/C12H16N2O3/c1-3-13-11(15)9(2)17-12(16)14-10-7-5-4-6-8-10/h4-9,13-14H,3H2,1-2H3
33 atoms
O  -0.914207 -1.240718 -0.404744
O  -3.811092 0.12839 1.144075
O  0.027372 -0.18301 1.345635
N  -2.660569 0.840951 -0.666672
N  1.209803 -0.69311 -0.549577
C  -2.153561 -1.343726 0.295212
C  -2.933927 -0.032589 0.305684
C  -2.962112 -2.427474 -0.392196
C  -3.360329 2.101405 -0.823342
C  2.504531 -0.260364 -0.244153
C  -2.759315 3.227045 -0.000002
C  0.109845 -0.656723 0.236669
C  3.405873 -0.180214 -1.308058
C  2.944303 0.049717 1.042402
C  4.719711 0.197804 -1.092288
C  4.264316 0.431603 1.241643
C  5.160354 0.509201 0.186837
H  -1.97567 -1.624843 1.33517
H  -3.16218 -2.182311 -1.435735
H  -3.916084 -2.553473 0.117692
H  -2.435229 -3.380539 -0.350436
H  -3.33249 2.355095 -1.882754
H  -4.408969 1.959206 -0.562434
H  -1.921257 0.637697 -1.320301
H  -2.808649 3.009737 1.067137
H  -3.306222 4.154088 -0.177774
H  1.085162 -1.077276 -1.475958
H  3.074374 -0.420028 -2.312125
H  2.282774 -0.01106 1.891487
H  5.400299 0.250118 -1.932397
H  4.59138 0.664598 2.247002
H  6.187262 0.803691 0.358222
H  -1.715507 3.399211 -0.265125
elementType: O N C H
totalener: -802.25008386 hartree
nucrepener: 1193.30621613 hartree
electener: -1995.55629999 hartree
oneelecener: -3460.14055475 hartree
twoeener: 1464.58425476 hartree
cpcmener: -0.03722648 hartree
kineticenergy: 798.76840262 hartree
xcener: -76.498337188537 hartree
chargesum: -0.0000000
charge: -0.337564 -0.530747 -0.486958 -0.187104 -0.155086 0.167380 0.313773 -0.266184 -0.018000 0.205084 -0.243773 0.508831 -0.234075 -0.238198 -0.116163 -0.136140 -0.195769 0.095393 0.100266 0.102100 0.102752 0.096492 0.082778 0.177090 0.086471 0.089783 0.172257 0.138456 0.154959 0.157085 0.156628 0.157116 0.081064
qa: -0.3376 -0.5307 -0.4870 -0.1871 -0.1551 0.1674 0.3138 -0.2662 -0.0180 0.2051 -0.2438 0.5088 -0.2341 -0.2382 -0.1162 -0.1361 -0.1958 0.0954 0.1003 0.1021 0.1028 0.0965 0.0828 0.1771 0.0865 0.0898 0.1723 0.1385 0.1550 0.1571 0.1566 0.1571 0.0811
va: 2.0737 1.9923 2.0167 3.1995 3.2468 3.7994 4.1499 3.9407 3.8713 3.7633 3.9025 4.2748 3.9505 3.9605 3.8969 3.9149 3.9188 1.0411 1.0067 1.0139 1.0076 1.0003 1.0156 1.0153 1.0102 1.0079 1.0209 1.0088 1.0286 0.9904 0.9920 0.9912 1.0068
dispcorr: -0.012791031 hartree
energy: -802.262874891884
dipole: -6.39464 7.58755 1.19292 5.16300 -5.54005 -0.37705 -4.70002 1.78699 -2.91303
magnitude: 3.17033 au
magnitude: 8.05834 debye
