program: Gaussian 09
title: 000055693
version: EM64L-G09RevD.01
frameworkgroup: C1[X(C21H22FNO2)]
method: RPBEPBE
basis: SDD
operation: Freq
keyword: #p
keyword: freq=noraman
keyword: PBEPBE/SDD
title: #p freq=noraman PBEPBE/SDD
converged: YES YES NO NO
title: Mulliken charges:
elementType: F O O N C C C C C C C C C C C C C C C C C C C C C H H H H H H H H H H H H H H H H H H H H H H
charge: -0.203087 -0.250027 -0.243306 0.001517 -0.179895 -0.009890 -0.461206 -0.461129 -0.490606 -0.444656 -0.451147 0.193948 -0.050057 0.331360 0.356124 -0.406908 -0.360074 -0.352546 -0.369242 -0.236313 -0.228249 -0.233573 -0.221898 -0.237052 -0.236549 0.234959 0.255539 0.215307 0.215590 0.250076 0.208135 0.244885 0.250003 0.227751 0.230060 0.225376 0.238466 0.290331 0.255379 0.258999 0.269085 0.228728 0.228980 0.228647 0.228146 0.229892 0.230128
chargesum: 0.00000
title: Mulliken charges with hydrogens summed into heavy atoms:
elementType: F O O N C C C C C C C C C C C C C C C C C C C C C
charge: -0.203087 -0.250027 -0.243306 0.001517 0.055064 0.245649 -0.030309 -0.002918 0.004282 0.013154 0.012696 0.193948 -0.050057 0.331360 0.356124 -0.116577 -0.104695 -0.093547 -0.100157 -0.007585 0.000731 -0.004927 0.006248 -0.007160 -0.006420
polarizability: 2.50936757e+02 1.32555915e+01 2.43583190e+02 8.99435293e+00 1.17035582e+01 1.89294307e+02
1716.lowfreq: -10.3132 -6.7142 -2.9009 -0.0010 -0.0009 -0.0009 8.0643 13.1195 24.3797
frequency: -10.1141 11.6460 24.2347 28.6091 41.4546 58.1545 67.8824 84.0341 118.9168 159.4855 186.0381 201.4046 211.5308 244.0254 268.8328 275.1404 285.1057 325.1209 331.5362 361.9193 392.6891 400.0592 402.1633 411.5189 440.6436 477.7962 505.8777 535.9999 550.7297 579.1994 591.1592 601.3041 614.5712 616.8592 658.0969 692.5339 703.2281 706.4499 726.5844 748.7412 765.7450 775.7921 791.6051 808.8074 816.9933 835.0846 854.4608 860.4116 872.2173 890.0003 903.7957 924.7992 934.9009 941.1900 952.8082 959.1115 971.0539 981.5313 987.2648 988.8944 990.2167 991.0405 999.3504 1001.2030 1001.9626 1021.5959 1029.0633 1034.1847 1054.7380 1075.7983 1087.0805 1093.7087 1099.2431 1129.8872 1162.6947 1171.4235 1173.7211 1174.9428 1183.3919 1192.6517 1198.7749 1201.7661 1216.0650 1230.4701 1231.3178 1272.6754 1298.8508 1300.1462 1306.3496 1309.5421 1313.7455 1314.5733 1318.9638 1322.8831 1329.3312 1347.3907 1362.2613 1379.2854 1382.3480 1434.8615 1435.2001 1439.2059 1460.8185 1468.7743 1472.1997 1478.3274 1482.1199 1483.4139 1589.9619 1592.7116 1601.6162 1609.6501 1612.5906 2983.1244 2995.3618 3003.4336 3007.1001 3009.3580 3026.5012 3039.5577 3048.1140 3055.6320 3068.8569 3077.5737 3081.4449 3127.2341 3127.4092 3138.0601 3139.5167 3151.4340 3155.1471 3161.6468 3166.8744 3170.7029 3173.0479
redmass: 3.9933 4.8238 3.9196 3.6637 3.6792 5.1176 5.3020 4.5584 3.7038 4.9310 5.1986 4.7937 3.8908 4.7957 2.8481 4.8850 3.7463 3.5497 5.6781 7.7957 2.4669 2.8508 2.8441 2.2136 4.4193 4.4665 4.0810 4.1546 5.3554 4.8794 7.2211 5.0430 6.4063 6.4111 5.7998 5.5354 1.8665 1.9276 4.2062 3.7176 1.8101 2.2884 1.5954 1.9752 2.5869 1.9029 1.2468 1.2521 2.9711 3.4168 3.9089 1.6654 1.9244 1.9700 3.2387 3.8966 4.6458 1.4076 1.4689 2.4721 5.2236 5.7140 1.3423 1.9001 1.6724 2.7752 2.1962 2.1590 2.8174 2.4203 1.5971 1.6581 1.6873 1.3569 3.0986 1.3433 1.0537 1.0695 2.5814 1.2400 1.1622 1.4497 1.4292 3.1483 1.3975 1.4396 1.3002 1.3023 1.3137 1.3970 1.3293 1.3951 1.3285 1.3313 1.3162 1.3735 1.5031 7.9658 8.9430 2.2323 2.2235 1.0851 1.0784 1.0834 1.0831 2.1899 2.1571 1.1011 6.1290 6.2469 9.7835 6.3507 6.1688 1.0600 1.0601 1.0606 1.0618 1.0631 1.0864 1.1029 1.0887 1.1028 1.1054 1.1048 1.1044 1.0850 1.0851 1.0887 1.0895 1.0932 1.0944 1.0960 1.0948 1.1002 1.0994
irintensity: 0.0735 0.6389 0.0250 0.0756 0.3917 0.5364 1.1788 0.6983 0.5670 1.0382 4.3207 1.6416 0.1641 4.8258 2.4743 1.3946 8.3274 8.9740 2.2279 2.3748 1.7504 0.1048 0.3437 1.6845 0.3914 4.1118 3.1926 1.0083 2.5616 13.2130 22.0229 1.0887 0.3902 0.3538 31.9511 2.8882 52.8672 44.7663 33.1244 12.7208 61.4616 39.4613 10.2079 7.6992 13.9941 12.5843 0.2271 0.0929 1.8297 3.8784 11.1509 20.8610 9.9541 9.7296 9.6580 42.2423 93.2950 0.9083 1.4615 35.0142 1.2042 6.0068 3.4475 13.4139 8.6120 4.9661 6.9269 5.4345 46.0159 21.5396 0.6228 21.9070 1.6101 8.9168 236.8415 4.6085 0.1163 0.4826 110.2688 9.4821 2.1639 33.5818 4.5690 46.4894 9.4205 7.3308 6.0002 4.0772 3.5481 3.4728 3.6494 2.9674 1.7447 3.8322 0.8906 0.9572 1.5512 0.1248 0.2594 10.2256 20.2910 14.7837 1.6551 10.7776 18.0902 14.0956 25.5780 7.1018 1.6233 1.1557 105.0315 16.9898 6.2411 32.7621 24.1845 87.6020 71.8008 25.9496 7.1793 10.1702 31.0240 3.6849 29.8543 33.6418 67.0724 0.1140 0.2070 9.0699 16.7940 22.2850 21.1517 17.2642 7.2510 16.3469 18.4173
temp: 298.150 k
press: 1.00000 atm
elementType: 9 8 8 7 6 6 6 6 6 6 6 6 6 6 6 6 6 6 6 6 6 6 6 6 6 1 1 1 1 1 1 1 1 1 1 1 1 1 1 1 1 1 1 1 1 1 1
symmnumber: 1
zpe: 1003852.1 jmol-1
zpe.correction: 0.382347 hartree
zpe.thermalcorrener: 0.402895 hartree
zpe.thermalcorrenthalpy: 0.403839 hartree
zpe.thermalcorrgfe: 0.330300 hartree
zpe.sumelectzpe: -1116.646128 hartree
zpe.sumelectthermal: -1116.625580 hartree
zpe.sumelectthermalent: -1116.624636 hartree
zpe.sumelectthermalfe: -1116.698175 hartree
dipole: 0.1980 1.6935 -0.0098
dipole: 1.7050
quadrupole: -129.3368 -136.6363 -147.2099
quadrupole: 9.6446 3.1256 0.7414
quadrupole: 8.3908 1.0914 -9.4822 9.6446 3.1256 0.7414
hfenergy: -1117.0284749 hartree
pointgroup: C01 [X(C21H22F1N1O2)]
dipole: 0.1498723 0.5946101 -0.2719722 debye
polarizability: 241.7134748|-9.4023067|230.7150082|9.5636006|-33.3393997|211.3857706 unknown
InChI: InChI=1S/C21H22FNO2/c22-21(17-7-3-1-4-8-17,18-9-5-2-6-10-18)20(24)25-19-15-23-13-11-16(19)12-14-23/h1-10,16,19H,11-15H2
charge 0 multiplicity 1
47 atoms
F  0.610299 -1.139441 -1.360765
O  -1.173755 0.344466 -0.335211
O  -0.238657 0.466068 1.790728
N  -4.673301 0.16475 0.344245
C  -3.092819 1.643745 -1.105809
C  -2.355384 1.144391 0.151731
C  -4.309828 2.481756 -0.618802
C  -3.601354 0.434729 -1.938354
C  -3.336167 0.253777 0.991536
C  -5.253554 1.537098 0.217158
C  -4.526931 -0.441631 -1.017251
C  -0.196755 0.080879 0.597154
C  1.008049 -0.685017 -0.013247
C  1.413838 -1.943368 0.763558
C  2.149298 0.329406 -0.210932
C  1.139625 -2.141525 2.138834
C  3.185083 0.459321 0.74358
C  2.134438 -2.936697 0.049517
C  2.128275 1.17669 -1.347269
C  1.571944 -3.323653 2.783984
C  4.197929 1.427003 0.559125
C  2.560884 -4.114537 0.696885
C  3.146377 2.136567 -1.531366
C  2.280879 -4.313901 2.06923
C  4.182922 2.266744 -0.577564
H  -2.411081 2.267033 -1.71039
H  -1.952925 1.980545 0.752589
H  -4.836525 2.894688 -1.499113
H  -3.967287 3.341625 -0.01121
H  -2.742573 -0.149183 -2.310701
H  -4.157562 0.8121 -2.816705
H  -2.922731 -0.766412 1.08769
H  -3.455604 0.665483 2.008482
H  -5.414958 1.935299 1.235325
H  -6.244096 1.440123 -0.261765
H  -5.538294 -0.54982 -1.448536
H  -4.109893 -1.456258 -0.888417
H  0.602525 -1.375083 2.704192
H  3.202531 -0.191889 1.623294
H  2.341997 -2.787919 -1.01438
H  1.329025 1.065453 -2.086397
H  1.351828 -3.466223 3.847834
H  4.998512 1.521548 1.301009
H  3.109591 -4.875672 0.131146
H  3.13133 2.78192 -2.416755
H  2.611714 -5.229065 2.572927
H  4.971738 3.013887 -0.720013
