program: Orca
programVersion: 5.0.2
elementType: O O O N N C C C C C C C C C C C C H H H H H H H H H H H H H H H H
charge: 0
multiplicity: 1
keywords: wb97x-d3
keywords: def2-TZVPP
keywords: def2/J RIJCOSX
keywords: DEFGRID2
keywords: scfconv7
keywords: smallprint printgap noloewdin
keywords: NOSOSCF
formula: C12H16N2O3
InChI: InChI=1/C12H16N2O3/c1-3-13-11(15)9(2)17-12(16)14-10-7-5-4-6-8-10/h4-9,13-14H,3H2,1-2H3
33 atoms
O  -0.937119 -1.303933 0.378208
O  -3.891107 0.118157 -1.018943
O  -0.006886 -0.238465 -1.380266
N  -2.611937 0.817223 0.712778
N  1.190837 -0.77579 0.502408
C  -2.196648 -1.372704 -0.291718
C  -2.9673 -0.053377 -0.253537
C  -3.004895 -2.461236 0.390635
C  -3.232036 2.116096 0.856569
C  2.478799 -0.301493 0.231262
C  -2.530636 3.201244 0.053986
C  0.083002 -0.721859 -0.285029
C  2.838949 0.361234 -0.940609
C  3.443484 -0.515862 1.216536
C  4.147909 0.791332 -1.102374
C  4.743847 -0.08044 1.039323
C  5.106979 0.578661 -0.125351
H  -3.971323 -2.55455 -0.10064
H  -3.17878 -2.230325 1.441952
H  -2.495006 -3.421825 0.326025
H  -4.272228 2.030481 0.5458
H  -3.237576 2.36966 1.918429
H  -1.813722 0.612039 1.286648
H  -1.482638 3.294739 0.340721
H  -2.570871 2.977865 -1.011037
H  -3.009096 4.167389 0.216805
H  1.08082 -1.259306 1.378743
H  2.115692 0.539351 -1.719543
H  3.174929 -1.030267 2.13285
H  4.416565 1.303145 -2.017223
H  5.474226 -0.258755 1.817393
H  6.123236 0.919192 -0.268735
H  -2.04837 -1.619938 -1.344753
totalener: -802.22462523 hartree
nucrepener: 1195.53747476 hartree
electener: -1997.76209999 hartree
oneelecener: -3464.21657430 hartree
twoeener: 1466.45447431 hartree
kineticenergy: 798.81630609 hartree
xcener: -76.499068780786 hartree
chargesum: 0.0000000
charge: -0.341839 -0.401652 -0.387903 -0.207204 -0.177246 0.135070 0.292049 -0.258985 -0.027358 0.206368 -0.225680 0.456424 -0.202572 -0.207321 -0.095857 -0.095761 -0.158390 0.111619 0.085808 0.092081 0.089687 0.080288 0.136136 0.064944 0.100971 0.079710 0.135990 0.154281 0.092195 0.126858 0.123666 0.125312 0.098312
qa: -0.3418 -0.4017 -0.3879 -0.2072 -0.1772 0.1351 0.2920 -0.2590 -0.0274 0.2064 -0.2257 0.4564 -0.2026 -0.2073 -0.0959 -0.0958 -0.1584 0.1116 0.0858 0.0921 0.0897 0.0803 0.1361 0.0649 0.1010 0.0797 0.1360 0.1543 0.0922 0.1269 0.1237 0.1253 0.0983
va: 2.0548 2.1326 2.1147 3.1685 3.2303 3.8590 4.1778 3.9270 3.8925 3.8459 3.9002 4.3018 4.0040 3.9950 3.9451 3.9954 3.9787 1.0144 1.0098 1.0098 1.0219 0.9993 1.0441 1.0104 1.0089 1.0099 1.0468 1.0312 1.0183 1.0009 1.0006 1.0008 1.0377
dispcorr: -0.012840145 hartree
energy: -802.237465370525
dipole: -5.67864 6.59085 0.91220 5.31707 -5.55984 -0.24277 4.66849 -2.92257 1.74593
magnitude: 1.98477 au
magnitude: 5.04488 debye
