program: Orca
programVersion: 5.0.2
elementType: O O O N N C C C C C C C C C C C C H H H H H H H H H H H H H H H H
charge: 0
multiplicity: 1
keywords: wb97x-d3
keywords: def2-TZVPP
keywords: def2/J RIJCOSX
keywords: DEFGRID2
keywords: scfconv7
keywords: smallprint printgap noloewdin
keywords: NOSOSCF
formula: C12H16N2O3
InChI: InChI=1/C12H16N2O3/c1-3-13-11(15)9(2)17-12(16)14-10-7-5-4-6-8-10/h4-9,13-14H,3H2,1-2H3
33 atoms
O  -0.955542 -1.419001 0.195218
O  -3.772787 0.356101 -1.037303
O  -0.064227 -0.058411 -1.365439
N  -2.57214 0.683861 0.851413
N  1.176576 -0.905387 0.368872
C  -2.223892 -1.347528 -0.459557
C  -2.914443 0.000565 -0.260086
C  -3.083345 -2.464011 0.103214
C  -3.109974 1.996258 1.140744
C  2.443293 -0.343648 0.175254
C  -2.40895 3.112027 0.381168
C  0.051103 -0.725058 -0.37325
C  3.414219 -0.641634 1.131963
C  2.777197 0.480094 -0.898209
C  4.693882 -0.128529 1.023143
C  4.06478 0.987133 -0.991571
C  5.029847 0.693032 -0.041962
H  -3.229416 -2.35677 1.178309
H  -2.63231 -3.436809 -0.090552
H  -4.060363 -2.441871 -0.375897
H  -4.173578 1.99154 0.903971
H  -3.025785 2.155486 2.216843
H  -1.819079 0.343952 1.422274
H  -2.842482 4.07848 0.640067
H  -1.345026 3.146475 0.616313
H  -2.514965 2.971525 -0.69302
H  1.089116 -1.527363 1.156008
H  3.167374 -1.28112 1.972361
H  2.048927 0.726027 -1.653396
H  5.429368 -0.373803 1.777815
H  4.310651 1.625564 -1.829968
H  6.029137 1.096663 -0.130026
H  -2.098397 -1.478681 -1.536105
totalener: -802.22429653 hartree
nucrepener: 1201.38828064 hartree
electener: -2003.61257717 hartree
oneelecener: -3475.97252356 hartree
twoeener: 1472.35994638 hartree
kineticenergy: 798.82272703 hartree
xcener: -76.500086843377 hartree
chargesum: -0.0000000
charge: -0.340077 -0.397426 -0.387795 -0.211833 -0.177345 0.132176 0.295998 -0.259937 -0.027015 0.206513 -0.225764 0.454751 -0.207401 -0.202908 -0.095397 -0.095394 -0.158830 0.085562 0.093424 0.110254 0.087156 0.077310 0.135884 0.079376 0.066576 0.103452 0.136161 0.092259 0.154981 0.123462 0.126683 0.125301 0.099841
qa: -0.3401 -0.3974 -0.3878 -0.2118 -0.1773 0.1322 0.2960 -0.2599 -0.0270 0.2065 -0.2258 0.4548 -0.2074 -0.2029 -0.0954 -0.0954 -0.1588 0.0856 0.0934 0.1103 0.0872 0.0773 0.1359 0.0794 0.0666 0.1035 0.1362 0.0923 0.1550 0.1235 0.1267 0.1253 0.0998
va: 2.0581 2.1347 2.1134 3.1609 3.2321 3.8555 4.1573 3.9309 3.9097 3.8435 3.8884 4.3033 3.9971 4.0027 3.9957 3.9441 3.9791 1.0103 1.0092 1.0127 1.0156 0.9996 1.0439 1.0096 1.0111 1.0120 1.0465 1.0184 1.0316 1.0007 1.0009 1.0008 1.0369
dispcorr: -0.013049429 hartree
energy: -802.237345955214
dipole: -5.58410 6.46149 0.87739 4.66288 -5.23350 -0.57062 5.29531 -3.58218 1.71312
magnitude: 2.00754 au
magnitude: 5.10276 debye
