program: Orca
programVersion: 5.0.2
elementType: Cl Cl O O N C C C C C C C C C C C H H H H H H H H H
charge: 0
multiplicity: 1
keywords: wb97x-d3
keywords: def2-TZVPP
keywords: def2/J RIJCOSX
keywords: DEFGRID2
keywords: scfconv7
keywords: smallprint printgap noloewdin
keywords: NOSOSCF
formula: C11H9Cl2NO2
InChI: InChI=1/C11H9Cl2NO2/c12-6-1-2-7-16-11(15)14-10-5-3-4-9(13)8-10/h1-8,14H
25 atoms
Cl 5.954009 0.310522 0.042278
Cl -6.805573 0.356922 1.222781
O  -0.799576 -0.162703 -0.741879
O  -0.560209 -0.485314 -2.957689
N  1.252964 -0.375651 -1.626631
C  2.032352 -0.2277 -0.472459
C  3.397826 -0.040319 -0.701652
C  1.567429 -0.28825 0.840426
C  4.266025 0.088226 0.364239
C  2.465802 -0.145969 1.888497
C  3.820934 0.043808 1.674869
C  -0.080332 -0.352286 -1.853685
C  -2.166114 -0.14042 -0.823702
C  -2.883902 0.06677 0.277753
C  -4.329406 0.097077 0.218068
C  -5.07989 0.311405 1.296023
H  3.773417 0.002982 -1.716191
H  0.529662 -0.45263 1.075428
H  1.783402 -0.455482 -2.484286
H  2.093627 -0.192112 2.902983
H  4.506656 0.14865 2.503403
H  -2.604693 -0.297703 -1.8005
H  -4.67979 0.472526 2.288587
H  -4.795046 -0.059263 -0.748985
H  -2.399245 0.220122 1.235749
elementType: Cl O N C H
totalener: -1550.26274548 hartree
nucrepener: 1135.97557946 hartree
electener: -2686.23832494 hartree
oneelecener: -4382.43309958 hartree
twoeener: 1696.19477464 hartree
cpcmener: -0.02762640 hartree
kineticenergy: 1546.29908285 hartree
xcener: -102.331683317263 hartree
chargesum: 0.0000000
charge: -0.092423 -0.109527 -0.263474 -0.507984 -0.142247 0.152453 -0.182321 -0.219913 0.121747 -0.138758 -0.190806 0.509608 0.105400 -0.185291 -0.157275 -0.032062 0.130516 0.162063 0.177274 0.161304 0.146980 0.143879 0.148199 0.124127 0.138530
qa: -0.0924 -0.1095 -0.2635 -0.5080 -0.1422 0.1525 -0.1823 -0.2199 0.1217 -0.1388 -0.1908 0.5096 0.1054 -0.1853 -0.1573 -0.0321 0.1305 0.1621 0.1773 0.1613 0.1470 0.1439 0.1482 0.1241 0.1385
va: 1.2117 1.1958 2.1535 1.9995 3.2444 3.8977 3.9856 3.9469 3.8676 3.9218 3.9807 4.2852 3.8406 3.9406 3.9728 4.0007 1.0216 1.0080 1.0173 0.9892 1.0033 1.0292 1.0068 1.0197 1.0124
dispcorr: -0.008963681 hartree
energy: -1550.271709163736
dipole: -0.55056 1.28256 0.73200 -1.49054 1.43381 -0.05673 1.32267 -0.38576 0.93690
magnitude: 1.19031 au
magnitude: 3.02552 debye
