program: Gaussian 09
title: 000006375
version: EM64L-G09RevD.01
frameworkgroup: C1[X(CH3NO2)]
method: RPBEPBE
basis: SDD
operation: Freq
keyword: #pfreq=noraman
keyword: PBEPBE/SDD
title: #p freq=noraman PBEPBE/SDD
converged: NO NO NO NO
title: Mulliken charges:
elementType: O O N C H H H
charge: -0.195639 -0.195346 0.148117 -0.551457 0.263364 0.262501 0.268460
chargesum: 0.00000
title: Mulliken charges with hydrogens summed into heavy atoms:
elementType: O O N C
charge: -0.195639 -0.195346 0.148117 0.242868
polarizability: 2.66811171e+01 1.52844635e-01 3.57154746e+01 4.30949592e-01 -3.90233302e-03 1.61388760e+01
1716.lowfreq: -16.7009 -0.0010 -0.0010 -0.0010 5.0832 8.4096 62.0202 445.9429 557.3056
frequency: 59.3348 445.9427 557.3054 606.6067 849.7284 1070.8911 1105.2543 1248.5984 1394.0555 1408.0027 1451.8298 1464.6877 3025.1657 3138.8490 3169.9075
redmass: 1.0865 3.3573 3.9702 7.1403 9.5317 1.4578 1.4630 10.1348 1.1906 2.7319 1.0494 1.4059 1.0308 1.1013 1.1071
irintensity: 0.1125 0.3266 2.4801 17.3578 9.2159 10.4069 2.3699 91.2512 4.0606 188.9939 23.5574 16.0213 0.8320 5.3461 1.7868
temp: 298.150 k
press: 1.00000 atm
elementType: 8 8 7 6 1 1 1
symmnumber: 1
zpe: 125584.9 jmol-1
zpe.correction: 0.047833 hartree
zpe.thermalcorrener: 0.052247 hartree
zpe.thermalcorrenthalpy: 0.053192 hartree
zpe.thermalcorrgfe: 0.020566 hartree
zpe.sumelectzpe: -244.687041 hartree
zpe.sumelectthermal: -244.682626 hartree
zpe.sumelectthermalent: -244.681682 hartree
zpe.sumelectthermalfe: -244.714308 hartree
dipole: 3.8828 -0.0186 0.0282
dipole: 3.8829
quadrupole: -22.2385 -26.9995 -21.6165
quadrupole: -0.0156 0.1021 -0.0003
quadrupole: 1.3796 -3.3813 2.0017 -0.0156 0.1021 -0.0003
hfenergy: -244.7348733 hartree
pointgroup: C01 [X(C1H3N1O2)]
dipole: 1.5275839 -0.0128186 0.007649 debye
dipolederiv: -0.5131274 -0.2209448 0.0049284 -0.0176757 -0.770495 -0.0002308 -0.0056864 0.0052773 -0.2159183 -0.5140144 0.2161373 0.0048448 0.014274 -0.7767521 -0.0000281 -0.0060298 -0.0052019 -0.2179605 1.0151315 0.0024256 -0.0100663 0.0041994 1.3144679 0.000331 0.0266895 -0.0001376 0.1032309 -0.1691885 -0.0010406 -0.0206903 -0.0117469 0.0807351 0.0001627 -0.0827855 0.0007062 0.166602 0.0545625 0.0067945 0.0057208 -0.0300737 0.0180338 0.0893119 0.0500006 0.0678534 0.0917406 0.0502718 -0.0055003 0.0045089 0.0392017 0.0016517 -0.077084 0.0433948 -0.0589416 0.1099908 0.0763645 0.0021283 0.0107536 0.0018211 0.1323585 -0.0124627 -0.0255832 -0.0095558 -0.0376854 unknown
polarizability: 26.6842246|0.1853715|35.7142557|0.4071971|-0.004238|16.1369874 unknown
InChI: InChI=1S/CH3NO2/c1-2(3)4/h1H3
charge 0 multiplicity 1
7 atoms
O  -0.702273 -1.1355 0.003155
O  -0.67803 1.14773 0.003262
N  -0.097933 -0.000305 -0.011489
C  1.415593 -0.013643 -0.00682
H  1.76824 0.86488 -0.564893
H  1.753761 -0.957567 -0.455533
H  1.741841 0.050106 1.044318
