program: Orca
programVersion: 5.0.2
elementType: O O O O O N N C C C C C C C C C C H H H H H H H H H H H H
charge: 0
multiplicity: 1
keywords: wb97x-d3
keywords: def2-TZVPP
keywords: def2/J RIJCOSX
keywords: DEFGRID2
keywords: scfconv7
keywords: smallprint printgap noloewdin
keywords: NOSOSCF
formula: C10H12N2O5
InChI: InChI=1/C10H12N2O5/c1-3-6(2)8-4-7(11(14)15)5-9(10(8)13)12(16)17/h4-6,13H,3H2,1-2H3
29 atoms
O  -0.64807 -2.453663 -0.295678
O  1.82715 -3.08425 -0.074246
O  3.332792 -1.600813 0.173026
O  0.243645 3.659844 -0.012932
O  2.26766 3.022955 0.210236
N  2.181424 -1.918588 0.02072
N  1.088221 2.796563 0.061233
C  -2.609353 -0.449957 -0.477875
C  -1.132309 -0.171556 -0.305162
C  -3.398922 0.000277 0.756183
C  -3.143819 0.210372 -1.746889
C  -0.191547 -1.218968 -0.222613
C  -0.690839 1.127706 -0.20949
C  -2.967754 -0.689289 2.040428
C  1.173903 -0.891406 -0.05896
C  0.661551 1.418844 -0.03934
C  1.603213 0.422659 0.034122
H  -2.756981 -1.525325 -0.58309
H  -4.456358 -0.204666 0.569525
H  -3.315148 1.085779 0.86864
H  -4.19134 -0.055408 -1.894371
H  -3.086087 1.299078 -1.696755
H  -2.590866 -0.115221 -2.628441
H  -1.413183 1.931314 -0.264161
H  -3.595223 -0.380157 2.876848
H  -3.045925 -1.774578 1.954971
H  -1.936081 -0.451549 2.305678
H  2.651701 0.647735 0.161123
H  0.097034 -3.084212 -0.232562
elementType: O N C H
totalener: -873.84037539 hartree
nucrepener: 1256.97689474 hartree
electener: -2130.81727012 hartree
oneelecener: -3685.40123547 hartree
twoeener: 1554.58396535 hartree
cpcmener: -0.02557929 hartree
kineticenergy: 870.45052537 hartree
xcener: -80.251562453082 hartree
chargesum: 0.0000000
charge: -0.330413 -0.396262 -0.384046 -0.398647 -0.401539 0.561304 0.560398 0.114951 -0.087040 -0.126322 -0.302621 0.242021 0.009490 -0.281234 -0.072468 -0.116102 0.084752 0.058966 0.076154 0.068593 0.098136 0.088263 0.104816 0.148134 0.098889 0.084292 0.083588 0.156871 0.257076
qa: -0.3304 -0.3963 -0.3840 -0.3986 -0.4015 0.5613 0.5604 0.1150 -0.0870 -0.1263 -0.3026 0.2420 0.0095 -0.2812 -0.0725 -0.1161 0.0848 0.0590 0.0762 0.0686 0.0981 0.0883 0.1048 0.1481 0.0989 0.0843 0.0836 0.1569 0.2571
va: 2.2023 1.8562 1.8840 1.8574 1.8541 4.0985 4.1184 3.7441 3.7298 3.8853 3.9405 4.0708 3.9914 3.9386 3.9635 4.1085 4.0260 1.0332 1.0081 1.0078 1.0025 1.0016 1.0023 1.0224 1.0036 1.0024 0.9995 1.0421 1.0419
dispcorr: -0.012801669 hartree
energy: -873.853177053636
dipole: -25.89448 23.81894 -2.07554 -2.44104 1.30161 -1.13943 1.35629 -1.60092 -0.24464
magnitude: 2.38034 au
magnitude: 6.05034 debye
