program: Orca
programVersion: 5.0.2
elementType: F F F F O O N N C C C C C C C C C C C C C C C C C C C H H H H H H H H H H H H H H H H
charge: 0
multiplicity: 1
keywords: wb97x-d3
keywords: def2-TZVPP
keywords: def2/J RIJCOSX
keywords: DEFGRID2
keywords: scfconv7
keywords: smallprint printgap noloewdin
keywords: NOSOSCF
formula: C19H16F4N2O2
InChI: InChI=1/C19H16F4N2O2/c1-25-10-13(11-5-4-6-12(9-11)19(21,22)23)16(18(25)27)17(26)24-15-8-3-2-7-14(15)20/h2-9,13,16,24H,10H2,1H3
43 atoms
F  -5.833579 -0.097367 0.129605
F  -5.279817 -1.984054 -0.728961
F  -5.837979 -1.869791 1.344908
F  5.06213 1.53886 0.722234
O  2.042784 2.52206 -1.880317
O  1.871294 -0.975683 -1.311649
N  -0.18625 2.266446 -2.345473
N  2.695705 0.237605 0.416312
C  -0.697412 0.38915 -1.057846
C  0.647801 0.962985 -0.622271
C  -1.33266 1.567943 -1.805278
C  0.949367 2.008839 -1.688927
C  -1.566567 -0.18521 0.028442
C  1.784764 -0.032936 -0.543089
C  -0.354778 3.334957 -3.297243
C  -2.911722 -0.423676 -0.235158
C  -1.068683 -0.530562 1.281814
C  -3.737788 -0.985729 0.730697
C  -1.895469 -1.083208 2.248113
C  -3.235654 -1.313918 1.982368
C  3.881265 -0.48576 0.623927
C  -5.169946 -1.23555 0.378282
C  5.07911 0.199109 0.787658
C  3.906709 -1.874393 0.705935
C  6.272936 -0.44738 1.02603
C  5.100988 -2.542524 0.927483
C  6.282392 -1.833015 1.088234
H  -0.508601 -0.397799 -1.794507
H  0.546219 1.51075 0.322879
H  -1.995219 1.247549 -2.608915
H  -1.903863 2.216091 -1.133299
H  -0.86355 4.188433 -2.845809
H  -0.948698 2.988579 -4.141908
H  0.612193 3.662538 -3.668865
H  -0.026204 -0.3723 1.524712
H  2.580225 1.098176 0.933543
H  -1.490134 -1.340171 3.217336
H  -3.863833 -1.747045 2.748127
H  2.987131 -2.434568 0.616323
H  7.181107 0.127145 1.151575
H  5.102629 -3.622047 0.987506
H  7.212968 -2.353199 1.269074
H  -3.314337 -0.173636 -1.210062
elementType: F O N C H
totalener: -1393.22080981 hartree
nucrepener: 2436.82971269 hartree
electener: -3830.05052250 hartree
oneelecener: -6752.83559755 hartree
twoeener: 2922.78507505 hartree
cpcmener: -0.05661636 hartree
kineticenergy: 1387.76541487 hartree
xcener: -126.792775174380 hartree
chargesum: 0.0000000
charge: -0.186101 -0.186595 -0.182004 -0.220027 -0.551721 -0.519740 -0.108487 -0.150100 0.133866 0.066733 -0.062492 0.247269 -0.068314 0.282220 -0.170304 -0.235620 -0.158576 -0.052672 -0.161219 -0.130731 0.115325 0.555490 0.233433 -0.201739 -0.173387 -0.158386 -0.145385 0.094488 0.122807 0.113810 0.115171 0.117905 0.115553 0.101798 0.135207 0.185056 0.161608 0.154206 0.155498 0.151593 0.162540 0.165372 0.136650
qa: -0.1861 -0.1866 -0.1820 -0.2200 -0.5517 -0.5197 -0.1085 -0.1501 0.1339 0.0667 -0.0625 0.2473 -0.0683 0.2822 -0.1703 -0.2356 -0.1586 -0.0527 -0.1612 -0.1307 0.1153 0.5555 0.2334 -0.2017 -0.1734 -0.1584 -0.1454 0.0945 0.1228 0.1138 0.1152 0.1179 0.1156 0.1018 0.1352 0.1851 0.1616 0.1542 0.1555 0.1516 0.1625 0.1654 0.1366
va: 1.1073 1.1084 1.1212 1.0670 1.9676 1.9909 3.2242 3.2347 3.7726 3.6046 3.8931 4.3087 3.8326 4.1737 3.8903 4.0972 3.8878 3.7224 3.9574 3.9191 3.5944 4.4345 4.0363 3.9690 3.8936 3.9282 3.8601 1.0373 1.0234 0.9982 0.9977 0.9878 0.9936 1.0164 1.0234 1.0068 0.9924 1.0047 1.0104 0.9996 0.9907 0.9867 1.0234
dispcorr: -0.021003929 hartree
energy: -1393.241813738253
dipole: 20.90162 -21.68951 -0.78789 7.64671 -7.07017 0.57655 -5.04372 6.70865 1.66492
magnitude: 1.93006 au
magnitude: 4.90583 debye
