program: Orca
programVersion: 5.0.2
elementType: F F F F O O N N C C C C C C C C C C C C C C C C C C C H H H H H H H H H H H H H H H H
charge: 0
multiplicity: 1
keywords: wb97x-d3
keywords: def2-TZVPP
keywords: def2/J RIJCOSX
keywords: DEFGRID2
keywords: scfconv7
keywords: smallprint printgap noloewdin
keywords: NOSOSCF
formula: C19H16F4N2O2
InChI: InChI=1/C19H16F4N2O2/c1-25-10-13(11-5-4-6-12(9-11)19(21,22)23)16(18(25)27)17(26)24-15-8-3-2-7-14(15)20/h2-9,13,16,24H,10H2,1H3
43 atoms
F  -5.540451 -2.116643 0.896316
F  -5.936426 -0.065081 1.387105
F  -5.548804 -0.627591 -0.653856
F  2.94649 -1.428448 2.012554
O  2.116642 2.182024 -2.386368
O  1.839302 -1.170285 -0.763726
N  -0.108272 1.836178 -2.79944
N  2.855961 0.611661 0.180147
C  -0.629927 0.271307 -1.148698
C  0.698178 0.944048 -0.821735
C  -1.258502 1.252113 -2.144613
C  1.020354 1.727002 -2.092055
C  -1.516108 -0.074246 0.018161
C  1.837035 0.013789 -0.468017
C  -0.265401 2.661709 -3.968516
C  -2.877038 -0.285541 -0.204036
C  -1.023795 -0.233603 1.308364
C  -3.719854 -0.632644 0.840006
C  -1.868184 -0.589175 2.352869
C  -3.217676 -0.788704 2.128722
C  4.061789 -0.053335 0.475064
C  -5.181054 -0.856677 0.608966
C  4.089215 -1.08153 1.406463
C  5.252187 0.319361 -0.135145
C  5.255795 -1.742952 1.730402
C  6.438242 -0.323943 0.185353
C  6.437516 -1.356132 1.112922
H  -0.41374 -0.652656 -1.694449
H  0.57239 1.69112 -0.027149
H  -1.898616 0.756912 -2.874488
H  -1.852274 2.021132 -1.64044
H  -0.773424 2.10603 -4.755878
H  0.706271 2.974954 -4.339969
H  -0.854616 3.551602 -3.741099
H  0.025453 -0.079174 1.525663
H  2.844161 1.617979 0.27373
H  -1.465993 -0.709117 3.34969
H  -3.865512 -1.061653 2.951992
H  5.239025 1.118615 -0.865278
H  5.24046 -2.540456 2.461743
H  7.358717 -0.024342 -0.29662
H  7.358949 -1.864941 1.361462
H  -3.271115 -0.176345 -1.205925
elementType: F O N C H
totalener: -1393.22044997 hartree
nucrepener: 2452.99771813 hartree
electener: -3846.21816810 hartree
oneelecener: -6785.80557986 hartree
twoeener: 2939.58741176 hartree
cpcmener: -0.05392914 hartree
kineticenergy: 1387.76158021 hartree
xcener: -126.791152544728 hartree
chargesum: 0.0000000
charge: -0.186720 -0.187780 -0.181629 -0.216917 -0.555644 -0.520954 -0.108342 -0.164048 0.136212 0.066609 -0.068241 0.255938 -0.059747 0.278383 -0.168413 -0.207469 -0.160594 -0.050017 -0.157561 -0.166445 0.099166 0.553498 0.221521 -0.199694 -0.160337 -0.149476 -0.142104 0.089647 0.130091 0.112914 0.117921 0.115911 0.101023 0.116562 0.135442 0.192462 0.160618 0.151430 0.154314 0.151917 0.163083 0.165778 0.141693
qa: -0.1867 -0.1878 -0.1816 -0.2169 -0.5556 -0.5210 -0.1083 -0.1640 0.1362 0.0666 -0.0682 0.2559 -0.0597 0.2784 -0.1684 -0.2075 -0.1606 -0.0500 -0.1576 -0.1664 0.0992 0.5535 0.2215 -0.1997 -0.1603 -0.1495 -0.1421 0.0896 0.1301 0.1129 0.1179 0.1159 0.1010 0.1166 0.1354 0.1925 0.1606 0.1514 0.1543 0.1519 0.1631 0.1658 0.1417
va: 1.1064 1.1069 1.1207 1.0722 1.9593 1.9901 3.2343 3.2018 3.7778 3.6240 3.9013 4.2767 3.8641 4.1643 3.8887 4.0022 3.8992 3.7177 3.9399 3.9950 3.5964 4.4274 4.0304 3.9736 3.9184 3.9055 3.8670 1.0366 1.0214 0.9969 0.9974 0.9927 1.0187 0.9881 1.0225 1.0026 0.9920 1.0052 1.0081 0.9993 0.9900 0.9864 1.0203
dispcorr: -0.021256908 hartree
energy: -1393.241706877805
dipole: 26.78898 -26.62852 0.16046 13.07535 -11.13504 1.94031 -11.96866 12.30850 0.33984
magnitude: 1.97637 au
magnitude: 5.02353 debye
