program: Orca
programVersion: 5.0.2
elementType: F F F F O O N N C C C C C C C C C C C C C C C C C C C H H H H H H H H H H H H H H H H
charge: 0
multiplicity: 1
keywords: wb97x-d3
keywords: def2-TZVPP
keywords: def2/J RIJCOSX
keywords: DEFGRID2
keywords: scfconv7
keywords: smallprint printgap noloewdin
keywords: NOSOSCF
formula: C19H16F4N2O2
InChI: InChI=1/C19H16F4N2O2/c1-25-10-13(11-5-4-6-12(9-11)19(21,22)23)16(18(25)27)17(26)24-15-8-3-2-7-14(15)20/h2-9,13,16,24H,10H2,1H3
43 atoms
F  -4.695766 -2.657892 1.019089
F  -5.326884 -1.235004 2.502283
F  -6.304363 -1.297212 0.591862
F  4.658479 2.052918 1.079355
O  1.524878 2.475566 -1.47175
O  1.770403 -1.540447 -0.551785
N  0.071504 1.141414 -2.632933
N  2.803156 0.313774 0.264402
C  -0.707723 -0.288972 -0.931187
C  0.507612 0.505919 -0.445197
C  -0.669625 -0.087854 -2.457592
C  0.777413 1.514196 -1.560129
C  -2.011768 0.179213 -0.335238
C  1.750405 -0.361822 -0.255724
C  0.13834 1.786091 -3.917048
C  -2.908174 -0.769782 0.148997
C  -2.375125 1.522477 -0.287801
C  -4.13978 -0.387461 0.661563
C  -3.604642 1.904748 0.22916
C  -4.494143 0.956225 0.704672
C  4.089898 -0.159935 0.529357
C  -5.108747 -1.398724 1.189487
C  5.040666 0.768114 0.957782
C  4.504966 -1.487262 0.417058
C  6.338639 0.429323 1.26044
C  5.812918 -1.841873 0.719611
C  6.733129 -0.895925 1.139429
H  -0.592615 -1.347137 -0.703021
H  0.316683 1.047627 0.485829
H  -0.162821 -0.917765 -2.958389
H  -1.666753 0.001281 -2.891436
H  0.736474 2.691121 -3.849592
H  -0.861498 2.055261 -4.259787
H  0.589801 1.125088 -4.659661
H  -1.706127 2.293607 -0.649564
H  2.659377 1.302379 0.416344
H  -3.87168 2.952749 0.260062
H  -5.449603 1.27211 1.104448
H  3.81613 -2.251183 0.098347
H  7.029937 1.19604 1.586054
H  6.106133 -2.878895 0.623415
H  7.750113 -1.179292 1.374151
H  -2.625441 -1.814268 0.114794
elementType: F O N C H
totalener: -1393.22813723 hartree
nucrepener: 2427.07924133 hartree
electener: -3820.30737856 hartree
oneelecener: -6733.10108032 hartree
twoeener: 2912.79370176 hartree
cpcmener: -0.03268635 hartree
kineticenergy: 1387.74677592 hartree
xcener: -126.789296632769 hartree
chargesum: -0.0000000
charge: -0.181829 -0.184896 -0.185582 -0.226146 -0.516309 -0.484669 -0.101537 -0.142602 0.179370 0.051305 -0.081267 0.219831 -0.077881 0.277612 -0.170259 -0.199588 -0.166429 -0.051449 -0.163182 -0.154860 0.089506 0.554741 0.243490 -0.194226 -0.168455 -0.171141 -0.159201 0.082289 0.130076 0.114102 0.117259 0.103996 0.114602 0.114758 0.151952 0.164423 0.157737 0.150107 0.162886 0.148728 0.156993 0.160288 0.135453
qa: -0.1818 -0.1849 -0.1856 -0.2261 -0.5163 -0.4847 -0.1015 -0.1426 0.1794 0.0513 -0.0813 0.2198 -0.0779 0.2776 -0.1703 -0.1996 -0.1664 -0.0514 -0.1632 -0.1549 0.0895 0.5547 0.2435 -0.1942 -0.1685 -0.1711 -0.1592 0.0823 0.1301 0.1141 0.1173 0.1040 0.1146 0.1148 0.1520 0.1644 0.1577 0.1501 0.1629 0.1487 0.1570 0.1603 0.1355
va: 1.1212 1.1085 1.1101 1.0562 2.0048 2.0249 3.1867 3.2774 3.6913 3.7729 3.9091 4.2031 3.7407 4.1785 3.8806 4.0520 3.9224 3.7211 3.9506 3.9900 3.8259 4.4294 3.9022 3.8982 3.9336 3.9421 3.8769 1.0553 1.0232 1.0007 0.9950 1.0201 0.9918 0.9894 1.0016 1.0471 0.9939 1.0062 1.0318 1.0001 0.9929 0.9886 1.0261
dispcorr: -0.020758306 hartree
energy: -1393.248895532202
dipole: 22.20772 -22.32920 -0.12148 8.01499 -7.53360 0.48139 -17.67155 16.75113 -0.92042
magnitude: 1.04578 au
magnitude: 2.65817 debye
