program: Orca
programVersion: 5.0.2
elementType: F F F F O O N N C C C C C C C C C C C C C C C C C C C H H H H H H H H H H H H H H H H
charge: 0
multiplicity: 1
keywords: wb97x-d3
keywords: def2-TZVPP
keywords: def2/J RIJCOSX
keywords: DEFGRID2
keywords: scfconv7
keywords: smallprint printgap noloewdin
keywords: NOSOSCF
formula: C19H16F4N2O2
InChI: InChI=1/C19H16F4N2O2/c1-25-10-13(11-5-4-6-12(9-11)19(21,22)23)16(18(25)27)17(26)24-15-8-3-2-7-14(15)20/h2-9,13,16,24H,10H2,1H3
43 atoms
F  -1.958761 -1.226955 3.180899
F  -1.126331 0.735424 2.902566
F  -3.199382 0.512063 3.425273
F  1.513945 -1.020288 2.578783
O  2.490653 0.196293 -3.259476
O  1.254646 -2.526181 -1.672852
N  0.314931 0.501277 -3.897505
N  2.151375 -1.262991 -0.058329
C  -0.810251 -0.511193 -2.119683
C  0.641826 -0.231094 -1.721566
C  -1.008411 0.418829 -3.325291
C  1.289681 0.171236 -3.043241
C  -1.866386 -0.337773 -1.0612
C  1.370348 -1.430552 -1.150304
C  0.522133 1.070194 -5.202845
C  -1.567581 -0.22968 0.289453
C  -3.207776 -0.304982 -1.445817
C  -2.580369 -0.07485 1.231823
C  -4.214394 -0.151624 -0.509564
C  -3.908377 -0.033432 0.838499
C  2.445584 -0.07753 0.64322
C  -2.218379 -0.008351 2.682323
C  2.126088 0.016172 1.993168
C  3.092841 0.999376 0.04727
C  2.422073 1.135604 2.742752
C  3.377529 2.142695 0.778058
C  3.04872 2.207966 2.124427
H  -0.86622 -1.538587 -2.492078
H  0.696297 0.642668 -1.063408
H  -1.713086 0.013762 -4.052129
H  -1.366712 1.408473 -3.023054
H  1.574306 1.019005 -5.470491
H  0.206844 2.115219 -5.227436
H  -0.052241 0.521015 -5.949443
H  -3.474726 -0.401475 -2.491297
H  2.558121 -2.118867 0.300734
H  -5.247781 -0.122669 -0.828334
H  -4.707914 0.087346 1.556616
H  3.37275 0.933224 -0.995587
H  2.160792 1.168945 3.792494
H  3.872626 2.974962 0.296179
H  3.280962 3.093462 2.700973
H  -0.539029 -0.273538 0.620584
elementType: F O N C H
totalener: -1393.22447511 hartree
nucrepener: 2605.08516794 hartree
electener: -3998.30964305 hartree
oneelecener: -7089.44350667 hartree
twoeener: 3091.13386362 hartree
cpcmener: -0.04133740 hartree
kineticenergy: 1387.74918860 hartree
xcener: -126.788353946897 hartree
chargesum: -0.0000000
charge: -0.186013 -0.182889 -0.181864 -0.217454 -0.520180 -0.485351 -0.102423 -0.131815 0.136082 0.005004 -0.061245 0.247043 -0.098673 0.248613 -0.171854 -0.114257 -0.210220 -0.058447 -0.138435 -0.135372 0.112715 0.551780 0.207733 -0.190360 -0.159641 -0.152960 -0.137429 0.097493 0.125202 0.109170 0.110976 0.104386 0.113867 0.114280 0.144761 0.176218 0.158878 0.149419 0.164816 0.149622 0.158995 0.161947 0.087882
qa: -0.1860 -0.1829 -0.1819 -0.2175 -0.5202 -0.4854 -0.1024 -0.1318 0.1361 0.0050 -0.0612 0.2470 -0.0987 0.2486 -0.1719 -0.1143 -0.2102 -0.0584 -0.1384 -0.1354 0.1127 0.5518 0.2077 -0.1904 -0.1596 -0.1530 -0.1374 0.0975 0.1252 0.1092 0.1110 0.1044 0.1139 0.1143 0.1448 0.1762 0.1589 0.1494 0.1648 0.1496 0.1590 0.1619 0.0879
va: 1.1018 1.1144 1.1198 1.0699 1.9959 2.0404 3.2455 3.1600 3.7920 3.5842 3.8883 4.2841 3.8441 4.3037 3.8891 3.9836 3.9676 3.7511 3.9240 3.9351 3.5881 4.4203 4.0107 3.9352 3.8757 3.9419 3.8762 1.0385 1.0182 0.9980 0.9965 1.0190 0.9883 0.9923 0.9989 1.0156 0.9920 1.0078 1.0296 1.0006 0.9919 0.9875 1.0214
dispcorr: -0.024196910 hartree
energy: -1393.248672016551
dipole: 4.52654 -6.24190 -1.71536 9.82290 -7.54652 2.27637 -32.18721 31.46287 -0.72435
magnitude: 2.94092 au
magnitude: 7.47522 debye
