program: Orca
programVersion: 5.0.2
elementType: F F F F O O N N C C C C C C C C C C C C C C C C C C C H H H H H H H H H H H H H H H H
charge: 0
multiplicity: 1
keywords: wb97x-d3
keywords: def2-TZVPP
keywords: def2/J RIJCOSX
keywords: DEFGRID2
keywords: scfconv7
keywords: smallprint printgap noloewdin
keywords: NOSOSCF
formula: C19H16F4N2O2
InChI: InChI=1/C19H16F4N2O2/c1-25-10-13(11-5-4-6-12(9-11)19(21,22)23)16(18(25)27)17(26)24-15-8-3-2-7-14(15)20/h2-9,13,16,24H,10H2,1H3
43 atoms
F  -6.042993 0.435315 0.27808
F  -5.093001 0.81407 2.165062
F  -4.458908 1.887845 0.409153
F  3.703341 -1.801795 1.691614
O  0.857875 2.437718 -0.677749
O  2.215537 -1.485117 -0.753843
N  -0.358074 1.246288 -2.206916
N  2.670209 0.416791 0.400608
C  -0.515929 -0.864728 -1.154363
C  0.410313 0.062432 -0.358232
C  -0.731547 -0.119454 -2.485632
C  0.346807 1.408288 -1.070441
C  -1.795691 -1.145462 -0.412082
C  1.856945 -0.43604 -0.278681
C  -0.522637 2.27829 -3.193889
C  -2.714129 -0.129534 -0.153182
C  -2.063447 -2.421561 0.06246
C  -3.867344 -0.388572 0.567645
C  -3.22138 -2.684383 0.781875
C  -4.125832 -1.671981 1.038963
C  4.052061 0.213778 0.538961
C  -4.862588 0.694784 0.852886
C  4.552661 -0.909018 1.186078
C  4.954757 1.159208 0.067968
C  5.909751 -1.106494 1.343008
C  6.318572 0.987974 0.239893
C  6.796073 -0.151223 0.86914
H  -0.006573 -1.808984 -1.344102
H  0.05846 0.203985 0.668503
H  -0.102988 -0.536476 -3.279499
H  -1.768486 -0.17501 -2.825247
H  0.062665 2.062569 -4.090979
H  -0.191307 3.227689 -2.781896
H  -1.571003 2.36667 -3.482415
H  -1.355888 -3.219569 -0.126667
H  2.324322 1.355897 0.54729
H  -3.415021 -3.684672 1.144848
H  -5.024243 -1.882769 1.604139
H  4.572679 2.03529 -0.441354
H  6.261267 -1.996328 1.847579
H  7.005055 1.73737 -0.129122
H  7.859543 -0.298464 0.99844
H  -2.518217 0.871872 -0.515751
totalener: -1393.20054126 hartree
nucrepener: 2467.76962288 hartree
electener: -3860.97016414 hartree
oneelecener: -6814.60910780 hartree
twoeener: 2953.63894367 hartree
kineticenergy: 1387.82575547 hartree
xcener: -126.793955813331 hartree
chargesum: -0.0000000
charge: -0.172681 -0.172038 -0.174454 -0.192835 -0.426233 -0.372061 -0.137428 -0.208241 0.187102 -0.039968 -0.123211 0.237060 -0.098585 0.251320 -0.177518 -0.132699 -0.197455 -0.091212 -0.092091 -0.144309 0.109275 0.539262 0.222310 -0.178815 -0.142563 -0.116514 -0.116489 0.094632 0.121439 0.111093 0.113533 0.102933 0.117547 0.103580 0.122790 0.172267 0.131453 0.121950 0.127774 0.121215 0.125878 0.127502 0.145484
qa: -0.1727 -0.1720 -0.1745 -0.1928 -0.4262 -0.3721 -0.1374 -0.2082 0.1871 -0.0400 -0.1232 0.2371 -0.0986 0.2513 -0.1775 -0.1327 -0.1975 -0.0912 -0.0921 -0.1443 0.1093 0.5393 0.2223 -0.1788 -0.1426 -0.1165 -0.1165 0.0946 0.1214 0.1111 0.1135 0.1029 0.1175 0.1036 0.1228 0.1723 0.1315 0.1219 0.1278 0.1212 0.1259 0.1275 0.1455
va: 1.1262 1.1290 1.1306 1.1106 2.0917 2.1484 3.1685 3.1836 3.6274 3.8246 3.9086 4.1664 3.7743 4.2587 3.8910 3.8730 4.0943 3.8908 3.9340 4.0573 3.6675 4.4493 4.1029 4.0086 3.9435 3.9701 3.9227 1.0543 1.0213 0.9958 0.9932 0.9912 1.0190 0.9930 1.0122 1.0433 1.0007 1.0151 1.0127 1.0085 1.0022 0.9989 1.0261
dispcorr: -0.021091829 hartree
energy: -1393.221633084384
dipole: 22.59098 -22.39111 0.19987 -1.01354 0.78933 -0.22421 -15.90482 15.04774 -0.85707
magnitude: 0.90818 au
magnitude: 2.30841 debye
