program: Orca
programVersion: 5.0.2
elementType: F F F F O O N N C C C C C C C C C C C C C C C C C C C H H H H H H H H H H H H H H H H
charge: 0
multiplicity: 1
keywords: wb97x-d3
keywords: def2-TZVPP
keywords: def2/J RIJCOSX
keywords: DEFGRID2
keywords: scfconv7
keywords: smallprint printgap noloewdin
keywords: NOSOSCF
formula: C19H16F4N2O2
InChI: InChI=1/C19H16F4N2O2/c1-25-10-13(11-5-4-6-12(9-11)19(21,22)23)16(18(25)27)17(26)24-15-8-3-2-7-14(15)20/h2-9,13,16,24H,10H2,1H3
43 atoms
F  -4.860758 1.559383 0.231329
F  -5.844397 0.233055 1.616307
F  -4.016695 1.221725 2.177175
F  4.096894 1.924527 1.393484
O  0.881081 2.195708 -0.544907
O  2.031514 -1.859641 -0.930755
N  -0.404685 1.22193 -2.168287
N  2.687328 0.051855 0.1273
C  -0.622642 -0.979808 -1.340389
C  0.368549 -0.183008 -0.484301
C  -0.837161 -0.090784 -2.581188
C  0.331587 1.233569 -1.040368
C  -1.89753 -1.270655 -0.592263
C  1.789551 -0.763536 -0.477902
C  -0.562431 2.364477 -3.026086
C  -2.70131 -0.243591 -0.110116
C  -2.27583 -2.58421 -0.338878
C  -3.849809 -0.523135 0.618044
C  -3.426029 -2.865884 0.380509
C  -4.216949 -1.838064 0.866896
C  4.032791 -0.201092 0.398305
C  -4.650505 0.621246 1.16239
C  4.746243 0.794287 1.067149
C  4.718388 -1.36948 0.069141
C  6.072847 0.6635 1.403617
C  6.056966 -1.511765 0.406236
C  6.739151 -0.506625 1.06979
H  -0.171482 -1.925276 -1.639209
H  0.048419 -0.141229 0.562315
H  -0.24327 -0.443646 -3.431333
H  -1.882703 -0.072099 -2.897397
H  -0.023138 2.227072 -3.966273
H  -0.171235 3.246795 -2.526636
H  -1.616275 2.52776 -3.256051
H  -1.65833 -3.395601 -0.704277
H  2.353236 0.979589 0.363059
H  -3.706678 -3.893459 0.568175
H  -5.109007 -2.068593 1.431715
H  4.207935 -2.164451 -0.447888
H  6.570569 1.471132 1.923074
H  6.566564 -2.427911 0.140571
H  7.78176 -0.625547 1.329501
H  -2.427029 0.787773 -0.301308
totalener: -1393.20464692 hartree
nucrepener: 2463.71312335 hartree
electener: -3856.91777027 hartree
oneelecener: -6806.23904991 hartree
twoeener: 2949.32127964 hartree
kineticenergy: 1387.80997082 hartree
xcener: -126.796899166907 hartree
chargesum: -0.0000000
charge: -0.175711 -0.173458 -0.167821 -0.209443 -0.412618 -0.406603 -0.136910 -0.174893 0.213865 -0.045941 -0.122721 0.229323 -0.103318 0.263608 -0.175669 -0.162021 -0.210238 -0.078730 -0.082783 -0.128403 0.077285 0.538596 0.220845 -0.158386 -0.154321 -0.133680 -0.121311 0.092581 0.124617 0.109131 0.114360 0.101479 0.119248 0.104258 0.121030 0.178601 0.131474 0.136089 0.153311 0.122933 0.124546 0.126650 0.131148
qa: -0.1757 -0.1735 -0.1678 -0.2094 -0.4126 -0.4066 -0.1369 -0.1749 0.2139 -0.0459 -0.1227 0.2293 -0.1033 0.2636 -0.1757 -0.1620 -0.2102 -0.0787 -0.0828 -0.1284 0.0773 0.5386 0.2208 -0.1584 -0.1543 -0.1337 -0.1213 0.0926 0.1246 0.1091 0.1144 0.1015 0.1192 0.1043 0.1210 0.1786 0.1315 0.1361 0.1533 0.1229 0.1245 0.1266 0.1311
va: 1.1265 1.1323 1.1300 1.0791 2.1038 2.1030 3.1685 3.2547 3.5865 3.8816 3.9183 4.1568 3.7945 4.2076 3.8891 3.9916 4.0923 3.8902 3.9416 3.9859 3.8699 4.4516 3.9594 3.9437 3.9761 3.9772 3.9213 1.0553 1.0162 0.9953 0.9931 0.9911 1.0189 0.9925 1.0130 1.0569 1.0011 1.0123 1.0356 1.0079 1.0029 0.9991 1.0369
dispcorr: -0.020806478 hartree
energy: -1393.225453402087
dipole: 19.61329 -19.77925 -0.16596 -10.11340 9.25691 -0.85649 -17.32439 16.29648 -1.02791
magnitude: 1.34823 au
magnitude: 3.42692 debye
