program: Gaussian 09
title: 000055507
version: EM64L-G09RevD.01
frameworkgroup: C1[X(C12H7NO4)]
method: RPBEPBE
basis: SDD
operation: Freq
keyword: #p
keyword: freq=noraman
keyword: PBEPBE/SDD
title: #p freq=noraman PBEPBE/SDD
converged: YES YES YES YES
title: Mulliken charges:
elementType: O O O O N C C C C C C C C C C C C H H H H H H H
charge: -0.200042 -0.425848 -0.217178 -0.193257 0.047325 0.147650 0.310155 0.437592 0.154993 -0.423812 -0.425861 -0.358470 -0.360669 -0.574146 0.264801 -0.402590 0.302006 0.294929 0.253337 0.268728 0.240527 0.269960 0.229156 0.360716
chargesum: 0.00000
title: Mulliken charges with hydrogens summed into heavy atoms:
elementType: O O O O N C C C C C C C C C C C C
charge: -0.200042 -0.065132 -0.217178 -0.193257 0.047325 0.147650 0.310155 0.437592 0.154993 -0.128884 -0.172524 -0.089742 -0.120141 -0.304186 0.264801 -0.173434 0.302006
polarizability: 3.16292870e+02 -1.47184282e+00 1.69612256e+02 -5.18864556e-03 2.17169127e-03 5.66894463e+01
1716.lowfreq: -6.9970 -3.6703 -0.0009 -0.0008 0.0009 4.8209 53.9886 65.8350 113.2478
frequency: 53.9874 65.8345 113.2465 124.5481 154.0100 229.2133 236.3072 270.8096 283.8954 348.0020 375.6863 382.9515 423.0792 430.4465 466.2927 510.6495 511.1524 556.3361 560.6154 606.0639 611.8602 651.2647 678.5414 691.1678 713.1373 751.3830 776.2652 810.5830 815.4785 824.6504 876.6990 895.8888 908.5346 934.1504 944.1849 962.8093 968.9017 1069.3277 1100.9376 1144.9815 1146.2730 1170.4138 1193.0681 1207.1598 1234.4842 1262.9641 1277.4418 1289.9561 1350.9729 1382.2573 1404.4736 1428.3234 1458.6079 1466.7812 1519.3595 1544.1358 1583.9066 1596.5930 1648.1916 3120.7989 3146.6450 3152.3579 3162.5825 3184.6630 3249.0729 3586.9352
redmass: 10.6117 8.5100 9.3209 8.4653 4.3159 7.8529 5.6503 5.2137 10.0806 1.1558 5.8844 4.9925 3.1929 10.4349 4.7721 3.4264 6.5274 6.1024 4.9193 3.3987 7.7831 7.2712 7.2724 3.9758 7.6334 9.3484 2.5242 1.4313 1.8155 5.3388 1.4641 1.6603 8.6719 3.1846 1.3645 5.1509 1.3782 2.1689 3.7465 1.3439 1.4250 1.5889 1.5452 4.5264 2.0667 2.8298 4.9620 1.9115 13.4972 3.2639 3.4959 3.6749 3.5087 7.2886 6.6233 5.5652 7.9066 6.6919 6.7930 1.0886 1.0898 1.0960 1.0926 1.0967 1.0990 1.0663
irintensity: 0.6259 0.8526 1.6068 0.8921 0.4019 2.6108 2.5345 11.7462 1.8754 142.2687 14.7888 5.2360 3.1109 0.2324 0.0302 6.0712 1.2696 2.9812 2.5895 1.7054 21.1456 3.3010 4.1003 12.8717 11.0636 8.9311 0.0212 68.2673 12.8105 10.7646 20.2238 49.5443 10.7615 58.1538 0.8805 6.2544 1.2319 56.2960 40.0865 58.9278 194.2119 106.1238 55.2816 334.3959 18.8803 14.9539 259.9757 2.5406 140.8856 6.7636 16.6567 7.1954 57.9113 52.6566 47.0674 145.5741 9.1628 45.6571 68.3076 11.7173 4.1686 10.7413 3.9216 3.0182 3.3918 72.1161
temp: 298.150 k
press: 1.00000 atm
elementType: 8 8 8 8 7 6 6 6 6 6 6 6 6 6 6 6 6 1 1 1 1 1 1 1
symmnumber: 1
zpe: 434258.1 jmol-1
zpe.correction: 0.165400 hartree
zpe.thermalcorrener: 0.178252 hartree
zpe.thermalcorrenthalpy: 0.179196 hartree
zpe.thermalcorrgfe: 0.125731 hartree
zpe.sumelectzpe: -815.861991 hartree
zpe.sumelectthermal: -815.849139 hartree
zpe.sumelectthermalent: -815.848195 hartree
zpe.sumelectthermalfe: -815.901660 hartree
dipole: -7.4436 -0.9606 0.0011
dipole: 7.5053
quadrupole: -120.6046 -82.9746 -99.3208
quadrupole: 12.3138 0.0067 -0.0005
quadrupole: -19.6379 17.9921 1.6458 12.3138 0.0067 -0.0005
hfenergy: -816.027391 hartree
pointgroup: C01 [X(C12H7N1O4)]
dipole: 2.9274908 -0.3858191 -0.0004338 debye
dipolederiv: -0.4877417 0.0739481 -0.0000237 0.195205 -0.3848772 0.0000111 -0.0001047 -0.0000113 -0.0858087 -1.8272589 0.3043679 -0.000026 0.2105736 -0.0793131 -0.0000166 -0.0000195 -0.0000132 -0.424278 -0.7369132 -0.1479418 0.0000278 -0.6227845 -0.8391213 -0.0001757 0.0004008 0.0003333 -0.2395006 -1.0854758 0.1262 -0.0000438 0.4334315 -0.4883371 0.0001206 0.0005554 -0.0001577 -0.2183795 2.6485947 0.2366961 -0.0001397 0.4079547 1.1622406 0.0000406 -0.0007837 -0.0001475 0.1951886 0.0136414 -0.1288928 0.0000124 -0.4672034 -0.2682507 0.0000162 -0.0000339 -0.0000113 0.0016283 0.1278778 0.0725191 -0.0000102 -0.2197459 -0.0941396 0.0000081 0.0000287 0.0000114 -0.0026653 0.3721371 -0.0061439 0.0000012 -0.2509421 -0.170391 0.0000054 0.000028 0.0000072 0.0503898 0.2990024 -0.033424 0.0000429 0.3605279 0.1430164 -0.0000052 -0.0000671 -0.0000236 0.0689388 0.6243734 0.288631 -0.000013 0.0419023 0.0162485 0.0000129 -0.0001231 -0.0000269 -0.1296158 0.0733445 -0.0433432 0.0000049 -0.0759373 0.1759093 0.000001 0.0000276 0.0000044 -0.1539608 -0.326343 0.0293968 0.000012 0.0014492 0.1029665 -0.0000066 0.0000244 0.0000081 -0.1567831 -0.0408975 -0.1117942 0.000008 0.1103566 0.1723375 -0.0000031 -0.000001 -0.0000046 -0.116738 -0.4222368 -0.0048331 0.0000008 0.5940427 0.0239575 0.0000063 -0.0000112 -0.0000027 -0.1873365 -1.4789061 -0.35419 0.0001322 -0.075354 0.361378 -0.0000332 0.0000675 0.0000163 0.0923509 -0.2820778 0.1396108 -0.0000073 -0.1386518 0.1018898 -0.0000059 0.0000017 0.0000025 -0.1860462 1.780727 -0.2953125 0.0000356 -0.4203096 -0.0103895 0.0000038 0.0000467 -0.0000024 0.0856229 0.115113 0.0028615 -0.0000007 -0.0001205 0.0641033 0.0000031 0.0000106 0.0000057 0.1895871 0.0168996 -0.108222 -0.0000022 -0.0338899 -0.0103898 0. -0.0000107 -0.0000062 0.1551791 0.0702106 0.0624372 -0.0000029 0.0161961 0.0047392 0.0000038 -0.0000065 0.0000034 0.1821634 0.0311949 -0.1042241 -0.0000037 -0.0470964 -0.0157767 -0.0000012 -0.0000026 -0.0000003 0.1480446 0.0562226 -0.0308154 -0.0000032 -0.0864577 -0.0003852 -0.0000023 -0.0000126 -0.0000017 0.1717394 -0.0124646 0.1015652 -0.0000041 0.101543 -0.0444949 0.0000022 -0.0000058 0.0000026 0.1709892 0.4709762 -0.0690969 0.0000025 -0.0346898 0.0770794 0.0000146 -0.000009 0.0000146 0.3892905 unknown
polarizability: 316.2997302|1.0770196|169.6053956|-0.0051945|-0.0021577|56.6894463 unknown
InChI: InChI=1S/C12H7NO4/c14-8-2-3-9-7(5-8)1-4-11-10(9)6-12(17-11)13(15)16/h1-6,14H
charge 0 multiplicity 1
24 atoms
O  -2.345504 1.125627 -0.000194
O  5.259005 -0.593135 0.000035
O  -4.313793 -1.877266 0.000316
O  -4.943011 0.336549 0.00042
N  -4.055387 -0.602605 -0.000301
C  -0.406409 -0.157027 -0.000119
C  1.022504 -0.339348 -0.000085
C  1.84321 0.856482 -0.000062
C  -0.937712 1.159923 -0.000133
C  -1.53575 -1.050513 -0.000128
C  1.226346 2.165997 -0.00008
C  -0.158775 2.339806 -0.00012
C  1.657911 -1.614482 -0.000062
C  3.263456 0.727193 -0.000019
C  -2.665603 -0.243128 -0.000238
C  3.052502 -1.721664 -0.000023
C  3.857466 -0.540716 -0.000001
H  -1.549733 -2.137217 -0.000115
H  1.879879 3.045112 -0.000064
H  -0.625847 3.327311 -0.000142
H  1.04772 -2.523819 -0.000073
H  3.903615 1.614608 0.000001
H  3.528873 -2.710257 -0.000007
H  5.584736 -1.527031 0.000092
