program: Gaussian 09
title: 000055525
version: EM64L-G09RevD.01
frameworkgroup: C1[X(C16H23NO4S)]
method: RPBEPBE
basis: SDD
operation: Freq
keyword: #p
keyword: freq=noraman
keyword: PBEPBE/SDD
title: #p freq=noraman PBEPBE/SDD
converged: YES YES NO NO
title: Mulliken charges:
elementType: S O O O O N C C C C C C C C C C C C C C C C H H H H H H H H H H H H H H H H H H H H H H H
charge: 0.312025 -0.282433 -0.333442 -0.467384 -0.249357 -0.297343 0.345805 -0.591555 0.276071 0.109173 -0.701455 -0.736396 -0.424687 0.272972 -0.217342 -0.364593 0.315443 -0.698362 -0.688400 -0.688927 0.300239 -0.669946 0.235573 0.238945 0.236367 0.248236 0.201936 0.209712 0.232102 0.233070 0.240079 0.226183 0.250374 0.229161 0.215798 0.214118 0.224992 0.237312 0.203443 0.232446 0.228510 0.206319 0.351942 0.289657 0.293617
chargesum: 0.00000
title: Mulliken charges with hydrogens summed into heavy atoms:
elementType: S O O O O N C C C C C C C C C C C C C C C C
charge: 0.312025 -0.282433 -0.333442 -0.467384 -0.249357 0.054599 0.345805 -0.117037 0.276071 0.109173 -0.014916 -0.061512 -0.184608 0.272972 0.008841 -0.114219 0.315443 -0.039286 -0.022653 -0.021652 0.300239 -0.086671
polarizability: 2.90188701e+02 2.03594400e+00 2.14515828e+02 1.21498810e+01 -9.30499348e-01 1.57555560e+02
1716.lowfreq: -8.9476 -0.0014 -0.0007 0.0009 3.5918 4.5768 14.6614 20.3784 22.5843
frequency: 13.8653 20.1672 21.8771 41.0121 45.1383 56.2745 72.4835 81.8799 99.0998 133.2756 164.2106 168.6441 193.4629 203.3742 211.1847 222.0857 239.3900 242.7604 254.0280 265.3103 279.4772 303.3404 307.5567 310.9734 322.8904 337.6802 376.3883 379.2074 410.8119 431.7044 435.9218 457.7713 483.0372 504.9917 525.5471 537.8302 577.8479 583.5000 618.8057 627.1479 632.3199 675.2830 697.6778 718.3843 726.0582 729.7223 735.8406 773.8592 813.0036 821.5053 837.5290 847.5926 890.8508 908.1618 910.8179 917.0396 936.7942 945.1093 954.7065 964.1268 972.9283 999.7953 1007.9293 1016.9540 1022.6661 1050.5251 1097.9816 1113.5531 1128.0300 1161.4331 1171.8039 1178.9277 1196.8451 1222.5741 1234.1032 1238.9250 1251.4913 1256.4056 1260.9790 1269.8818 1286.3337 1294.4489 1369.8035 1373.3950 1382.4654 1395.6848 1395.8084 1400.4459 1413.5365 1445.2065 1448.1147 1452.7244 1461.2246 1462.1979 1462.6219 1463.1790 1463.9637 1469.6568 1470.0103 1474.1245 1483.6336 1486.2624 1493.9391 1605.8268 1620.0376 1695.1050 2977.2312 2982.4391 2984.3041 2986.2676 2991.4797 2991.9905 3045.9919 3051.6363 3074.1294 3079.8795 3080.6236 3082.8896 3088.6464 3090.8489 3094.2377 3096.8622 3102.0659 3102.1289 3129.9551 3134.4078 3151.9974 3171.7600 3565.1930
redmass: 4.6948 4.5024 3.7382 4.4320 3.8829 4.1714 5.9271 7.5618 4.6764 4.2507 2.6568 1.2145 1.0670 4.0223 2.2709 3.5434 1.0841 1.4526 2.7741 1.0829 4.0022 2.7360 2.9220 3.3595 3.0827 2.7310 3.1256 2.5777 4.7606 2.7875 3.0348 2.6680 3.2546 4.6869 4.6365 3.8488 5.4464 4.2610 3.8764 5.8234 2.3333 3.1377 7.2887 3.8435 5.2556 5.8888 4.3560 1.5409 3.2860 3.4117 2.9821 5.6010 1.4755 1.5998 1.6580 1.5556 1.3738 1.2063 1.3498 2.0553 2.2305 2.9541 1.5407 1.4181 1.4176 2.0018 1.5047 6.7008 1.8843 1.4413 1.7443 2.2648 1.9895 1.6275 1.4150 2.0445 2.8863 2.3430 3.1660 2.9001 1.2016 2.2934 1.2475 1.2342 1.2508 1.2111 1.6953 2.5175 1.0958 1.0489 1.1210 2.1922 1.7056 1.1175 1.1070 1.1625 1.2971 1.0895 1.0564 1.0624 1.0548 1.8777 1.0678 7.6412 8.8025 9.9224 1.0350 1.0354 1.0568 1.0393 1.0392 1.0353 1.0564 1.0996 1.0993 1.0988 1.1007 1.0990 1.0990 1.0998 1.0997 1.1007 1.0999 1.1000 1.1093 1.0875 1.0919 1.0985 1.0773
irintensity: 0.5184 0.3866 0.3675 0.4074 1.1903 2.9067 2.3882 0.4962 5.9308 2.8183 1.4126 0.3864 0.1515 0.7134 0.6884 2.4329 0.1532 1.0587 0.3474 0.2524 3.6268 1.2476 1.3952 3.4953 2.7200 5.3338 9.3671 1.3691 38.6147 0.6631 4.2363 0.4005 4.1297 2.0690 1.0563 0.1761 2.2383 22.7631 12.6509 4.1796 52.6246 62.0893 51.7477 5.3902 28.9794 23.3190 23.9898 47.9196 19.1566 18.8001 45.0457 58.7316 3.2897 0.7968 2.0758 1.2963 1.2726 0.0702 1.3311 2.3240 12.5024 150.1848 29.8358 0.0960 3.8058 30.2248 64.0455 153.7515 207.5998 308.6535 172.5203 45.0498 53.5082 31.5705 107.2724 16.0542 26.2730 8.8194 5.0141 69.3642 9.7069 52.9199 36.3738 37.2831 32.4412 24.7217 9.7476 32.0573 25.9509 0.8004 8.8633 54.0420 83.7686 32.0489 7.6816 51.2138 57.6372 26.7140 4.2504 15.4436 20.7750 376.3422 3.2064 7.5627 12.5324 327.6002 20.7545 17.1738 24.2884 11.4913 36.7503 20.1919 22.5054 13.4494 0.2053 45.9389 17.2464 8.2646 42.3288 18.7233 52.1763 13.2530 22.4476 43.1216 3.2522 3.8048 17.2623 14.4939 42.2874
temp: 298.150 k
press: 1.00000 atm
elementType: 16 8 8 8 8 7 6 6 6 6 6 6 6 6 6 6 6 6 6 6 6 6 1 1 1 1 1 1 1 1 1 1 1 1 1 1 1 1 1 1 1 1 1 1 1
symmnumber: 1
zpe: 955091.2 jmol-1
zpe.correction: 0.363775 hartree
zpe.thermalcorrener: 0.388059 hartree
zpe.thermalcorrenthalpy: 0.389003 hartree
zpe.thermalcorrgfe: 0.307261 hartree
zpe.sumelectzpe: -1375.514257 hartree
zpe.sumelectthermal: -1375.489973 hartree
zpe.sumelectthermalent: -1375.489029 hartree
zpe.sumelectthermalfe: -1375.570771 hartree
dipole: -0.0507 -2.3722 1.7303
dipole: 2.9367
quadrupole: -99.9502 -130.6427 -143.6193
quadrupole: -1.9729 4.2909 -0.2853
quadrupole: 24.7872 -5.9053 -18.8819 -1.9729 4.2909 -0.2853
hfenergy: -1375.8780321 hartree
pointgroup: C01 [X(C16H23N1O4S1)]
dipole: -0.019997 1.1437323 -0.1623722 debye
polarizability: 289.6096697|-5.137475|187.4181489|-13.4629103|-28.5476237|185.2322699 unknown
InChI: InChI=1S/C16H23NO4S/c1-15(2,3)21-22-10-17-14(18)19-12-8-6-7-11-9-16(4,5)20-13(11)12/h6-8,17H,9-10H2,1-5H3
charge 0 multiplicity 1
45 atoms
S  -3.934954 -1.104377 -0.766327
O  2.387529 1.202101 -0.395449
O  0.313484 -0.301562 1.084677
O  -4.661194 -0.306007 0.721444
O  0.091101 -0.83272 -1.224481
N  -1.594419 0.263535 -0.001573
C  3.674262 1.49212 -1.188661
C  4.796958 0.740432 -0.393666
C  4.024697 -0.263938 0.450438
C  2.654973 0.082789 0.393782
C  3.452464 0.891941 -2.587473
C  3.827591 3.014971 -1.206116
C  4.450868 -1.345051 1.240106
C  1.690624 -0.661591 1.098633
C  3.483956 -2.08452 1.970725
C  2.112622 -1.745536 1.895876
C  -6.038889 0.29787 0.547469
C  -6.01404 1.428211 -0.499551
C  -6.293113 0.83853 1.969268
C  -7.043964 -0.808067 0.170914
C  -0.362253 -0.33652 -0.171774
C  -2.595836 0.232192 -1.036296
H  5.513805 0.259749 -1.082765
H  5.363779 1.443041 0.247685
H  2.553543 1.33012 -3.053004
H  3.303965 -0.200136 -2.524112
H  4.324742 1.095684 -3.236263
H  4.742239 3.300892 -1.757256
H  3.897939 3.411691 -0.178662
H  2.961584 3.485882 -1.70248
H  5.511103 -1.615267 1.294789
H  3.795358 -2.931073 2.590937
H  1.356445 -2.317375 2.442827
H  -5.718616 1.033567 -1.488997
H  -7.016547 1.882595 -0.60026
H  -5.304846 2.221604 -0.201926
H  -5.537602 1.596769 2.238519
H  -6.242879 0.019147 2.706191
H  -7.294454 1.303291 2.022066
H  -7.015834 -1.620724 0.917364
H  -6.803004 -1.233306 -0.820466
H  -8.071455 -0.402382 0.129846
H  -1.856965 0.563064 0.93914
H  -2.121634 -0.013846 -2.000327
H  -3.135734 1.188509 -1.094614
