program: Gaussian 09
title: 000055496
version: EM64L-G09RevD.01
frameworkgroup: C1[X(C18H15ClN2O)]
method: RPBEPBE
basis: SDD
operation: Freq
keyword: #p
keyword: freq=noraman
keyword: PBEPBE/SDD
title: #p freq=noraman PBEPBE/SDD
converged: YES YES NO NO
title: Mulliken charges:
elementType: Cl O N N C C C C C C C C C C C C C C C C C C H H H H H H H H H H H H H H H
charge: -0.032247 -0.203485 -0.177465 -0.414399 -0.175006 -0.547200 0.420590 0.218115 -0.584237 0.103885 -0.425218 0.246956 0.489743 -0.398221 -0.350429 -0.352107 -0.420541 -0.252129 -0.213284 -0.230016 -0.219542 -0.235991 0.280779 0.302629 0.253103 0.231819 0.279921 0.310613 0.237520 0.230525 0.254809 0.231643 0.225011 0.224937 0.230445 0.227906 0.230567
chargesum: 0.00000
title: Mulliken charges with hydrogens summed into heavy atoms:
elementType: Cl O N N C C C C C C C C C C C C C C C C C C
charge: -0.032247 -0.203485 -0.177465 -0.103785 0.105772 -0.244571 0.420590 0.218115 -0.099315 0.103885 -0.145297 0.246956 0.489743 -0.160701 -0.119904 -0.097298 -0.188897 -0.027118 0.011653 0.000428 0.008364 -0.005424
chargesum: 0.00019
polarizability: 2.33930400e+02 3.57604892e+01 2.01218691e+02 1.17276124e+01 -1.80975341e+01 1.98804296e+02
1716.lowfreq: -4.2672 -0.9098 -0.0015 -0.0014 4.7737 8.0387 11.6261 16.5506 25.2057
frequency: 11.3167 16.4868 25.0973 33.2434 47.9825 64.3448 101.1201 129.8457 153.3389 184.6884 209.6428 219.6528 240.8877 272.1082 311.2721 337.2649 372.4805 402.4915 420.9074 451.3420 466.0879 517.0342 531.4143 537.5314 550.7406 575.8045 610.7755 615.5614 617.8679 640.4649 703.1656 708.3379 733.7945 751.4947 757.0906 766.0447 770.9174 793.9546 808.4724 815.7959 837.9661 853.8437 857.2901 867.5758 911.6615 931.0874 934.9566 950.7361 975.9489 980.2101 989.9745 998.5569 1012.1560 1012.4709 1026.1106 1049.3313 1081.6787 1097.0757 1100.8920 1130.7440 1140.8123 1166.0028 1170.1076 1173.6255 1189.3829 1205.2772 1211.3187 1239.0620 1250.8706 1272.1275 1301.2370 1305.7693 1325.2331 1337.6218 1353.4688 1365.4866 1387.1647 1400.6179 1426.0071 1441.9856 1458.1481 1458.5750 1484.3147 1485.1725 1557.1697 1588.2862 1595.9228 1613.6387 1632.6492 1728.7087 2990.9920 3024.5173 3048.5950 3118.2272 3119.0005 3124.1484 3127.5627 3135.3546 3135.4549 3147.9545 3148.7009 3164.6446 3165.6715 3221.6964 3609.7868
redmass: 5.9907 4.1314 4.6951 8.2180 9.3444 5.6343 5.7171 6.2052 5.4459 6.0798 6.5141 4.1331 5.5357 8.4287 5.5007 2.5877 5.2095 2.8094 2.8385 4.3926 3.5480 3.5570 3.4838 1.6929 6.1858 2.6829 5.5404 6.0255 6.0782 3.2618 3.2412 2.5255 2.5365 1.3644 4.8828 3.7825 4.1635 3.0699 3.5835 1.8049 3.1132 1.5453 1.2478 5.0297 1.9735 1.7367 1.3992 5.2314 1.3103 1.3893 6.2252 1.3338 2.4986 2.8217 2.2337 3.5117 1.8885 1.6437 1.5357 1.4241 1.4525 1.1977 1.1306 1.0557 1.1218 2.1709 1.4019 1.9588 1.8883 1.9590 2.5213 1.5794 1.4478 1.8660 1.9002 1.8857 5.7880 4.8648 2.2435 2.0652 1.8435 1.7305 2.1760 3.0751 6.0481 6.1528 6.0628 6.0279 6.9359 11.8661 1.0592 1.0860 1.1029 1.0871 1.0894 1.0870 1.0851 1.0891 1.0914 1.0961 1.0955 1.1015 1.1003 1.0982 1.0810
irintensity: 0.1625 0.5051 1.0418 0.1865 1.4733 1.0621 0.0754 0.2750 0.9418 2.7078 7.6585 5.6128 0.7552 7.5955 4.7918 2.8197 1.5789 0.1213 12.0647 9.1406 10.3833 22.1909 10.7890 65.1819 3.7275 14.7601 34.0834 3.9063 12.4534 1.5905 20.7617 34.1088 37.8629 97.0979 1.8495 13.7495 20.4556 21.1441 12.7188 16.0191 6.3730 0.7958 0.0768 0.8716 19.4224 24.5069 3.1374 2.9680 0.1244 0.1246 0.4841 1.3636 11.7038 5.0979 7.6891 13.3339 19.2731 22.5088 17.8231 11.0719 8.9247 4.3597 0.6493 0.0323 1.2902 9.4800 5.9540 29.1837 1.9788 29.8021 9.1768 8.3967 14.4630 49.4181 25.4042 19.6091 1.9593 50.6662 15.0881 11.1174 1.1616 46.1254 10.3066 0.1746 36.8247 0.7383 0.9496 3.2829 1.7221 484.0803 27.8323 7.9131 7.1952 6.6457 6.0225 0.7983 0.8742 4.6460 11.4877 32.3505 31.6049 21.4658 25.1159 0.1577 69.0717
temp: 298.150 k
press: 1.00000 atm
elementType: 17 8 7 7 6 6 6 6 6 6 6 6 6 6 6 6 6 6 6 6 6 6 1 1 1 1 1 1 1 1 1 1 1 1 1 1 1
symmnumber: 1
zpe: 750215.3 jmol-1
zpe.correction: 0.285742 hartree
zpe.thermalcorrener: 0.304312 hartree
zpe.thermalcorrenthalpy: 0.305257 hartree
zpe.thermalcorrgfe: 0.234315 hartree
zpe.sumelectzpe: -1338.171639 hartree
zpe.sumelectthermal: -1338.153068 hartree
zpe.sumelectthermalent: -1338.152124 hartree
zpe.sumelectthermalfe: -1338.223066 hartree
dipole: -3.7374 -4.3621 -2.5796
dipole: 6.2969
quadrupole: -125.5897 -146.3161 -122.2910
quadrupole: -8.9624 15.0795 -2.7198
quadrupole: 5.8092 -14.9172 9.1080 -8.9624 15.0795 -2.7198
hfenergy: -1338.457381 hartree
pointgroup: C01 [X(C18H15Cl1N2O1)]
dipole: -1.472575 1.4324714 1.3845335 debye
polarizability: 232.9982291|-31.361626|213.5334632|-19.809276|-15.1617595|187.4216945 unknown
InChI: InChI=1S/C18H15ClN2O/c19-16-17(14-10-20-15-9-5-4-8-13(14)15)21(18(16)22)11-12-6-2-1-3-7-12/h1-10,16-17,20H,11H2
charge 0 multiplicity 1
37 atoms
Cl 0.645338 -2.479613 -2.859811
O  2.166185 -3.502876 0.189026
N  1.068953 -1.363023 0.496612
N  -3.113811 -0.555659 1.61504
C  -0.032639 -0.976161 -0.454861
C  0.140478 -2.427454 -1.062621
C  -1.342136 -0.620282 0.176921
C  1.319747 -2.620413 -0.059728
C  1.761003 -0.590048 1.531779
C  -2.349204 0.272312 -0.372749
C  -1.847225 -1.10556 1.386818
C  -3.451644 0.294111 0.552786
C  2.583292 0.562289 0.956948
C  -2.430245 1.048912 -1.559566
C  -4.612567 1.067434 0.330688
C  3.674484 0.294444 0.090241
C  2.267674 1.905387 1.274099
C  -3.584302 1.822089 -1.786328
C  -4.663003 1.832074 -0.85202
C  4.439915 1.353897 -0.442552
C  3.033879 2.968673 0.741556
C  4.122329 2.694796 -0.117148
H  0.291951 -0.202592 -1.174067
H  -0.721774 -3.099118 -0.956216
H  2.411817 -1.309644 2.064057
H  1.017502 -0.203055 2.254267
H  -1.394185 -1.795766 2.096604
H  -3.693373 -0.737087 2.431628
H  -1.614227 1.045586 -2.290664
H  -5.445426 1.075498 1.042505
H  3.922372 -0.743662 -0.163382
H  1.420207 2.121567 1.936655
H  -3.662197 2.426727 -2.696417
H  -5.547804 2.44366 -1.060187
H  5.282689 1.136543 -1.108121
H  2.78078 4.004478 0.99409
H  4.717366 3.516734 -0.530683
