program: Gaussian 09
title: 000055474
version: EM64L-G09RevD.01
frameworkgroup: C1[X(C14H9I2NO3)]
method: RPBEPBE
basis: SDD
operation: Freq
keyword: #p
keyword: freq=noraman
keyword: PBEPBE/SDD
title: #p freq=noraman PBEPBE/SDD
converged: YES YES NO NO
title: Mulliken charges:
elementType: I I O O O N C C C C C C C C C C C C C C H H H H H H H H H
charge: 0.154616 0.132523 -0.209507 -0.426425 -0.291305 -0.497202 0.511149 0.097971 -0.467065 0.266188 -0.220022 0.092524 -0.102974 -0.371631 -0.329849 -0.345139 0.144409 -0.227793 -0.236157 -0.224248 0.368044 0.296759 0.275711 0.273121 0.241124 0.233736 0.232005 0.233647 0.395789
chargesum: 0.00000
title: Mulliken charges with hydrogens summed into heavy atoms:
elementType: I I O O O N C C C C C C C C C C C C C C
charge: 0.154616 0.132523 -0.209507 -0.030636 -0.291305 -0.129158 0.511149 0.097971 -0.467065 0.266188 0.076737 0.092524 0.172737 -0.371631 -0.056728 -0.104015 0.144409 0.005943 -0.004152 0.009399
polarizability: 3.71503543e+02 3.14065623e+00 2.07236680e+02 6.25802534e+00 -1.48174741e+01 1.21155435e+02
1716.lowfreq: -1.8510 0.0005 0.0006 0.0007 2.2481 5.3064 20.1111 26.7016 32.9134
frequency: 20.0865 26.6936 32.9051 61.3455 83.0550 89.0402 107.8969 116.1306 130.7043 138.2575 168.8554 172.6616 200.7884 247.0707 300.5788 324.0215 338.7773 365.7112 400.1869 405.9259 420.8289 458.9172 488.3678 540.5041 556.2160 591.3780 612.9255 613.8964 635.0289 673.1045 678.8952 695.2983 701.2345 733.1488 777.7055 785.9061 795.8622 833.3494 858.0585 891.6606 895.1478 924.4650 943.5562 988.1194 990.3104 1007.0391 1021.6837 1025.8227 1070.1462 1088.4360 1112.2401 1124.5723 1174.3369 1189.5363 1202.0805 1251.3759 1274.7358 1317.8932 1319.4449 1359.5310 1372.7627 1387.2157 1429.2009 1435.7597 1468.6029 1482.0878 1536.8688 1566.2000 1582.0214 1609.0322 1613.5143 1624.4076 3129.5711 3137.6258 3149.0530 3160.0633 3170.9796 3179.7928 3193.1831 3325.3486 3531.4659
redmass: 9.5823 6.6522 4.7603 7.9114 18.7727 12.8517 8.2386 11.1959 8.7526 11.9143 5.6927 4.7787 14.0276 6.8361 7.5113 8.2449 7.6446 7.1386 4.0361 4.5938 4.5888 4.1452 4.9327 4.4558 4.6804 1.2694 5.4291 6.3883 6.8643 4.2653 4.9936 6.4907 1.5762 2.4674 2.4720 5.7828 2.8739 5.9753 1.2720 2.6457 1.7568 1.4115 1.4736 1.6177 3.7300 1.3428 2.9834 3.9122 2.8248 1.6960 2.2148 2.5194 1.0600 1.1167 1.7142 3.7422 2.2372 2.0493 1.3298 9.7699 3.9677 9.2442 3.3981 2.3602 2.4274 2.3546 4.7411 7.3612 5.8774 6.8383 7.4324 3.5396 1.0851 1.0884 1.0926 1.0962 1.1012 1.0932 1.0929 1.0775 1.0643
irintensity: 0.1720 0.4994 0.2855 0.5661 0.1783 0.2579 0.3500 2.7296 0.5187 0.8429 0.7342 0.9537 3.0375 6.8634 2.8797 0.7068 1.6800 6.1287 1.2296 0.8862 7.5844 8.4604 2.1676 21.9843 37.9086 135.4825 47.5131 1.9910 4.0877 42.4523 35.7417 20.5440 66.7981 22.5985 125.0126 10.3328 11.2846 54.3488 0.2431 44.0058 6.0725 8.1036 0.5772 2.5527 1.0464 2.0698 12.5698 182.7704 130.4595 10.6162 0.9153 283.2753 2.7219 31.4325 2.8415 233.9369 121.4916 179.3164 2.2514 78.2200 15.1849 1.6388 208.5731 34.9682 489.4237 60.6250 67.8007 127.8878 50.2461 130.6385 85.7156 13.5988 1.5837 6.0996 22.4081 16.2549 24.9197 0.0751 3.0186 137.8305 74.6263
temp: 298.150 k
press: 1.00000 atm
elementType: 53 53 8 8 8 7 6 6 6 6 6 6 6 6 6 6 6 6 6 6 1 1 1 1 1 1 1 1 1
symmnumber: 1
zpe: 517015.3 jmol-1
zpe.correction: 0.196921 hartree
zpe.thermalcorrener: 0.215295 hartree
zpe.thermalcorrenthalpy: 0.216239 hartree
zpe.thermalcorrgfe: 0.145723 hartree
zpe.sumelectzpe: -840.954247 hartree
zpe.sumelectthermal: -840.935873 hartree
zpe.sumelectthermalent: -840.934929 hartree
zpe.sumelectthermalfe: -841.005445 hartree
dipole: -1.1447 2.8069 -2.0590
dipole: 3.6645
quadrupole: -123.2447 -131.2479 -146.0430
quadrupole: -2.1637 2.2569 -0.8260
quadrupole: 10.2672 2.2639 -12.5311 -2.1637 2.2569 -0.8260
hfenergy: -841.151168 hartree
pointgroup: C01 [X(C14H9I2N1O3)]
dipole: -0.3990457 -0.8756521 1.0735772 debye
polarizability: 369.7408682|-9.136282|195.8549315|-20.2570797|-32.2968592|134.2998585 unknown
InChI: InChI=1S/C14H9I2NO3/c15-9-6-10(14(19)20)12(11(16)7-9)17-13(18)8-4-2-1-3-5-8/h1-7,17,19H
charge 0 multiplicity 1
29 atoms
I  0.745936 3.339202 -0.348302
I  6.089565 0.488912 -0.705751
O  -0.879904 0.950942 -1.839085
O  2.339022 -3.19611 0.929629
O  0.259547 -2.285231 1.356251
N  -0.237741 0.121936 0.266318
C  1.155217 0.249081 0.099237
C  2.010297 -0.88092 0.370731
C  1.78611 1.467046 -0.298449
C  -2.628613 0.325718 -0.271155
C  3.410378 -0.8101 0.150737
C  -1.202422 0.51105 -0.699427
C  3.175558 1.52251 -0.540792
C  3.977792 0.377583 -0.332549
C  -3.621853 0.315622 -1.285201
C  -3.016958 0.196598 1.088715
C  1.436929 -2.134519 0.914169
C  -4.981146 0.161639 -0.94733
C  -4.379512 0.044844 1.424678
C  -5.363391 0.022488 0.408822
H  -0.511443 -0.64254 0.907347
H  4.017982 -1.692211 0.361122
H  3.630519 2.463425 -0.857805
H  -3.302123 0.437099 -2.325395
H  -2.268503 0.247211 1.887272
H  -5.742031 0.15137 -1.735152
H  -4.674373 -0.047109 2.475562
H  -6.420398 -0.094944 0.672401
H  1.894258 -3.993895 1.323703
