program: Gaussian 09
title: 000055431
version: EM64L-G09RevD.01
frameworkgroup: C1[X(C14H7NO3)]
method: RPBEPBE
basis: SDD
operation: Freq
keyword: #p
keyword: freq=noraman
keyword: PBEPBE/SDD
title: #p freq=noraman PBEPBE/SDD
converged: NO NO NO NO
title: Mulliken charges:
elementType: O O O N C C C C C C C C C C C C C C H H H H H H H
charge: -0.244845 -0.226239 -0.189872 0.011159 0.319929 0.346847 0.193256 0.284125 -0.549299 0.198895 0.058908 -0.494887 -0.295737 0.071456 -0.379350 -0.437524 -0.158196 -0.352521 0.246675 0.293896 0.225414 0.270856 0.287919 0.270168 0.248967
chargesum: 0.00000
title: Mulliken charges with hydrogens summed into heavy atoms:
elementType: O O O N C C C C C C C C C C C C C C
charge: -0.244845 -0.226239 -0.189872 0.011159 0.319929 0.346847 0.193256 0.284125 -0.302624 0.198895 0.058908 -0.200991 -0.070323 0.071456 -0.108494 -0.149606 0.111972 -0.103555
polarizability: 2.89741692e+02 -3.54463207e+00 1.76449715e+02 -2.57215350e-03 -9.91254767e-04 6.27781373e+01
1716.lowfreq: -0.0010 -0.0007 0.0003 7.6750 10.8246 16.9890 64.6322 69.8290 130.1935
frequency: 64.6301 69.8248 130.1933 174.6566 177.2125 206.7748 290.9729 318.1295 328.5663 346.8614 351.1024 384.8505 434.9916 459.0494 487.7162 540.9916 573.9386 576.7050 601.2461 676.8707 677.2078 689.0614 711.1136 735.9901 740.3316 766.5074 767.1245 785.7376 837.8767 847.4284 863.6718 870.8816 873.1500 894.8574 953.3038 953.8104 974.9568 978.7784 983.4342 1046.4704 1080.3439 1120.4546 1146.4344 1159.0134 1206.9188 1232.3736 1251.0676 1268.3255 1292.7691 1315.5980 1329.1043 1383.5141 1416.7855 1430.1371 1461.6269 1482.4381 1528.5842 1540.1438 1580.8714 1589.4677 1637.6968 1665.3325 3138.4894 3153.3503 3159.3497 3171.1983 3196.1330 3225.5525 3267.0865
redmass: 6.3903 6.7369 4.9229 6.1724 7.6198 6.6846 9.6298 4.9499 9.1826 5.2898 6.6744 3.5909 3.2338 7.2824 8.3798 4.0788 4.4280 8.9434 8.2394 6.6170 6.5036 5.6944 6.6039 2.5744 7.5043 7.0710 1.4734 3.8007 6.7749 1.4260 1.3320 4.7983 1.5090 1.6095 1.4442 8.7109 4.1565 1.4812 3.8362 2.6622 2.3927 1.6164 3.4076 2.3237 1.8537 3.1518 1.4745 2.0998 1.9444 9.1891 2.5516 2.4874 4.3007 2.7033 5.0112 3.3440 5.1747 8.2206 6.6221 8.9251 8.3631 12.1530 1.0888 1.0927 1.0928 1.0949 1.0943 1.0929 1.1075
irintensity: 0.0156 0.1310 0.0119 0.2096 1.0476 2.6281 0.2308 4.5030 9.4875 4.4880 2.3196 0.0224 10.6135 0.7925 3.4592 10.7482 0.3714 6.6189 8.3666 0.0562 2.8806 17.8461 0.8189 4.6218 7.2761 0.1267 41.0565 21.4096 13.8188 35.1127 0.8932 1.0869 22.9809 46.1437 2.1433 137.0758 56.3692 0.6942 50.1488 18.0624 59.8861 109.6554 0.8045 7.5849 4.3056 33.4056 2.2011 16.4464 6.6143 57.4133 18.7777 43.3863 0.6316 18.1561 37.1694 24.0485 13.0968 42.7409 107.5310 82.3466 142.9080 353.8566 12.6915 1.5626 0.2868 17.5527 1.6909 3.5528 0.1937
temp: 298.150 k
press: 1.00000 atm
elementType: 8 8 8 7 6 6 6 6 6 6 6 6 6 6 6 6 6 6 1 1 1 1 1 1 1
symmnumber: 1
zpe: 458033.0 jmol-1
zpe.correction: 0.174456 hartree
zpe.thermalcorrener: 0.186816 hartree
zpe.thermalcorrenthalpy: 0.187761 hartree
zpe.thermalcorrgfe: 0.135548 hartree
zpe.sumelectzpe: -816.907063 hartree
zpe.sumelectthermal: -816.894702 hartree
zpe.sumelectthermalent: -816.893758 hartree
zpe.sumelectthermalfe: -816.945971 hartree
dipole: 5.0901 -5.2053 -0.0033
dipole: 7.2804
quadrupole: -105.8869 -101.7667 -104.8058
quadrupole: 0.2128 0.0119 -0.0098
quadrupole: -1.7338 2.3865 -0.6527 0.2128 0.0119 -0.0098
hfenergy: -817.0815187 hartree
pointgroup: C01 [X(C14H7N1O3)]
dipole: 1.9896029 -2.060526 -0.0013007 debye
dipolederiv: -1.6141635 0.4884498 0.0004148 0.1243173 -0.4835093 0.0001342 -0.0005047 0.0000381 -0.1963359 -0.9469364 0.2011299 -0.0000475 -0.0583651 -0.5341998 -0.0000343 -0.0000786 -0.0000322 -0.1361268 -0.9366734 0.4064415 -0.0003757 0.5810925 -1.0257457 0.0004801 0.0017231 -0.0012584 -0.3246916 -0.4913316 -0.0107476 -0.0000225 0.0940254 -0.50594 0.0000714 0.0000021 -0.0000484 -0.2529195 -0.5957961 -0.036718 -0.0000428 0.0726768 -0.1481519 0.0000246 -0.0000653 -0.0000675 -0.0213985 0.9779765 0.0737723 0.0001047 0.3679031 0.2536992 -0.0001015 0.0002941 0.0002833 0.0637099 0.7332224 -0.3131957 0.0000025 -0.3122765 0.4470026 -0.0000609 0.000046 -0.0001229 0.0859841 -0.0577116 -0.0981344 0.0000134 -0.5145132 -0.1727105 -0.0000561 -0.0000492 0.0000011 0.0459496 0.3505502 0.0400353 0.0000545 -0.1294391 0.0776548 0.0000093 0.0000984 -0.000032 -0.1363045 0.7594549 -0.1201847 0.000045 0.459931 0.1239695 0.0000534 0.0001265 0.0000232 0.0463142 -0.4893582 -0.0991738 0.0000111 0.1159572 -0.5538396 -0.0000336 0.0003025 0.0003734 0.0335428 -0.3208053 0.1235318 0.000014 0.0518399 0.0073447 0.0000087 -0.0001554 0.0001743 -0.1486208 -0.5280692 -0.2845932 0.0000718 -0.4321692 -0.1594001 0.0000216 0.0000289 0.0000005 -0.1025509 1.9288268 -0.4934867 -0.000037 -0.2834927 1.4525827 -0.0003998 -0.0015383 0.0006134 0.2760772 -0.0868637 -0.1494653 0.0000039 -0.0599047 -0.0338885 0.0000031 0.0000405 -0.0000215 -0.2255698 0.3424175 0.0451463 -0.0000465 -0.1093661 0.268244 -0.0001407 0.0000083 -0.0000019 -0.019518 -0.0248193 -0.0097063 0.0000248 -0.1047207 0.5537217 0.0000296 0.0000023 0.0000141 -0.1086058 0.4904872 0.1485332 -0.0001156 0.0069139 0.3967696 -0.0001094 -0.0001341 -0.0001182 -0.0570839 0.096088 -0.0488082 -0.0000148 -0.0300989 -0.0484131 -0.0000079 0.0000035 0.000012 0.1514151 0.1058417 -0.0062185 -0.0000075 -0.0060659 0.0428729 -0.0000079 -0.0000198 0.000008 0.1965494 0.0256212 0.1263485 -0.0000017 0.0783777 0.0044603 0.0000216 -0.000148 -0.0000134 0.1450693 0.0945917 0.0113912 -0.0000139 0.0711666 -0.0042644 0.0000022 -0.0000139 -0.0000023 0.1981952 0.0851057 0.0411518 -0.000028 0.0707214 0.0309874 0.0000355 -0.0000334 0.0000497 0.1322585 0.0267784 0.0149527 -0.0000269 0.001262 0.1020742 -0.0000007 -0.0000431 0.0000051 0.2176612 0.0755663 -0.0504518 0.0000199 -0.0557726 -0.0913208 0.0000576 0.0001079 0.0001224 0.1369994 unknown
polarizability: 289.6923318|-4.2607571|176.4990751|-0.0025784|-0.000975|62.7781373 unknown
InChI: InChI=1S/C14H7NO3/c16-14-11-7-15-3-1-9(11)10-5-8-2-4-17-12(8)6-13(10)18-14/h1-7H
charge 0 multiplicity 1
25 atoms
O  -0.523793 2.072658 -0.00046
O  4.16513 0.764372 0.000235
O  -2.71081 2.748777 0.000971
N  -4.133105 -1.2672 0.000382
C  0.117983 -0.333607 -0.000483
C  -1.307447 -0.688222 -0.000459
C  0.45946 1.062005 -0.000286
C  2.503694 -0.862647 -0.000083
C  1.163347 -1.293589 -0.000306
C  2.775773 0.543686 0.000032
C  -2.290614 0.350411 -0.000607
C  1.787598 1.53038 -0.000021
C  -1.795878 -2.02444 -0.00008
C  -1.924378 1.782517 -0.001491
C  3.802355 -1.523796 0.00012
C  -3.671322 0.010598 -0.000056
C  4.755039 -0.530372 0.000278
C  -3.182176 -2.259762 0.000338
H  0.930054 -2.362076 -0.000326
H  2.000758 2.600868 0.000091
H  -1.112704 -2.878068 0.00003
H  3.997412 -2.594186 0.000126
H  -4.416801 0.812614 -0.000249
H  5.841804 -0.536888 0.000445
H  -3.570979 -3.284232 0.000758
