program: Orca
programVersion: 5.0.2
elementType: F O N N N N N C C C C C C C C C C C C C C C C C H H H H H H H H H H H H H H H H H H H H H H H H
charge: 0
multiplicity: 1
keywords: wb97x-d3
keywords: def2-TZVPP
keywords: def2/J RIJCOSX
keywords: DEFGRID2
keywords: scfconv7
keywords: smallprint printgap noloewdin
keywords: NOSOSCF
formula: C17H24FN5O
InChI: InChI=1/C17H24FN5O/c1-10-6-11(2)8-13(7-10)24-9-12(3)20-16-22-14(17(4,5)18)21-15(19)23-16/h6-8,12,20H,9,19H2,1-5H3
48 atoms
F  3.56762 -2.185494 2.222847
O  -2.760658 1.250407 0.647838
N  -1.453235 -1.216601 -0.540857
N  0.330714 -1.684373 0.829127
N  2.503039 -1.650686 -0.076617
N  0.630731 -1.194292 -1.466573
N  2.755911 -1.180052 -2.297068
C  -2.412712 -1.177255 0.547143
C  -2.33829 0.105478 1.372187
C  2.172037 -2.189191 2.277098
C  -3.803436 -1.414902 -0.018845
C  1.645543 -1.809003 0.906753
C  -0.130085 -1.360757 -0.384771
C  -1.906226 1.91609 -0.173486
C  1.754167 -1.173443 3.32392
C  1.731062 -3.598388 2.628842
C  -0.523759 1.905251 -0.05274
C  -2.512095 2.689652 -1.165579
C  0.258938 2.655939 -0.932109
C  -1.745568 3.446804 -2.037584
C  -0.354993 3.416915 -1.916653
C  1.934474 -1.340669 -1.259036
C  1.752843 2.62803 -0.796279
C  -2.393805 4.28405 -3.100131
H  -2.177249 -1.987772 1.239524
H  -3.032459 0.014735 2.209073
H  -1.342584 0.234777 1.800235
H  -1.754279 -0.852738 -1.432939
H  -4.070257 -0.671572 -0.771562
H  -4.549099 -1.369942 0.774367
H  -3.869474 -2.39886 -0.482055
H  2.092501 -0.170345 3.060276
H  2.178293 -1.437917 4.293138
H  0.671589 -1.148147 3.426482
H  0.646305 -3.657391 2.688186
H  2.138043 -3.890973 3.597389
H  2.069292 -4.316072 1.880069
H  -3.592916 2.691826 -1.249207
H  0.253768 3.995753 -2.602381
H  2.071786 3.058187 0.154711
H  2.135229 1.606684 -0.826632
H  2.23803 3.189889 -1.593121
H  -2.189478 5.344769 -2.944825
H  -3.475048 4.15332 -3.111521
H  3.749674 -1.266309 -2.174665
H  2.395153 -0.923338 -3.199593
H  -0.026787 1.3220 0.712236
H  -2.01537 4.030785 -4.091382
elementType: F O N C H
totalener: -1111.28324707 hartree
nucrepener: 2194.81951064 hartree
electener: -3306.10275771 hartree
oneelecener: -5876.64004865 hartree
twoeener: 2570.53729094 hartree
cpcmener: -0.03710085 hartree
kineticenergy: 1106.44116736 hartree
xcener: -106.881261672012 hartree
chargesum: -0.0000000
charge: -0.266585 -0.358947 -0.198648 -0.455617 -0.387842 -0.408101 -0.243326 0.157837 -0.012035 0.333517 -0.300019 0.227925 0.322123 0.256034 -0.313115 -0.311875 -0.198406 -0.268330 -0.003204 0.029663 -0.243852 0.332780 -0.215530 -0.211330 0.076128 0.124173 0.111268 0.167767 0.090505 0.093819 0.105210 0.110193 0.109825 0.093463 0.097690 0.104797 0.109683 0.122402 0.125622 0.108940 0.085487 0.094162 0.102963 0.092594 0.193449 0.192196 0.122696 0.101852
qa: -0.2666 -0.3589 -0.1986 -0.4556 -0.3878 -0.4081 -0.2433 0.1578 -0.0120 0.3335 -0.3000 0.2279 0.3221 0.2560 -0.3131 -0.3119 -0.1984 -0.2683 -0.0032 0.0297 -0.2439 0.3328 -0.2155 -0.2113 0.0761 0.1242 0.1113 0.1678 0.0905 0.0938 0.1052 0.1102 0.1098 0.0935 0.0977 0.1048 0.1097 0.1224 0.1256 0.1089 0.0855 0.0942 0.1030 0.0926 0.1934 0.1922 0.1227 0.1019
va: 1.0044 2.0319 3.1904 2.9239 3.0096 2.9658 3.2068 3.7873 3.8438 3.9235 3.9508 4.0202 4.3064 3.8049 3.9324 3.9276 3.7884 4.0138 3.7334 3.7464 3.9257 4.3256 3.9002 3.8945 1.0276 1.0029 1.0043 1.0240 1.0060 1.0035 1.0069 1.0056 1.0071 1.0128 1.0127 1.0051 1.0072 1.0212 1.0101 0.9955 1.0011 1.0055 0.9946 1.0057 1.0089 1.0094 1.0175 0.9959
dispcorr: -0.025783456 hartree
energy: -1111.309030528710
dipole: -12.08149 11.23586 -0.84563 7.53897 -7.60374 -0.06477 -0.46175 -0.13923 -0.60098
magnitude: 1.03945 au
magnitude: 2.64208 debye
