program: Orca
programVersion: 5.0.2
elementType: F O N N N N N C C C C C C C C C C C C C C C C C H H H H H H H H H H H H H H H H H H H H H H H H
charge: 0
multiplicity: 1
keywords: wb97x-d3
keywords: def2-TZVPP
keywords: def2/J RIJCOSX
keywords: DEFGRID2
keywords: scfconv7
keywords: smallprint printgap noloewdin
keywords: NOSOSCF
formula: C17H24FN5O
InChI: InChI=1/C17H24FN5O/c1-10-6-11(2)8-13(7-10)24-9-12(3)20-16-22-14(17(4,5)18)21-15(19)23-16/h6-8,12,20H,9,19H2,1-5H3
48 atoms
F  1.26357 -2.108461 3.292272
O  -2.634616 1.442714 0.781309
N  -1.380843 -1.10474 -0.456933
N  0.37599 -1.66124 0.91508
N  2.533509 -1.800756 -0.013561
N  0.691076 -1.243727 -1.397793
N  2.804566 -1.408791 -2.247321
C  -2.329812 -0.995736 0.635745
C  -2.175314 0.282738 1.456835
C  2.256173 -2.284205 2.324834
C  -3.736224 -1.152719 0.080558
C  1.674273 -1.876299 0.98457
C  -0.069646 -1.333863 -0.308325
C  -1.871635 2.044605 -0.1703
C  2.614212 -3.759579 2.299199
C  3.433342 -1.411734 2.716719
C  -0.484605 2.014093 -0.201727
C  -2.575379 2.771202 -1.131525
C  0.204175 2.699601 -1.20401
C  -1.902191 3.463237 -2.126663
C  -0.507325 3.415375 -2.157154
C  1.984213 -1.480447 -1.197248
C  1.703591 2.650592 -1.235621
C  -2.655819 4.250479 -3.157499
H  -2.138743 -1.814673 1.331739
H  -2.807877 0.196381 2.341301
H  -1.14911 0.395926 1.811868
H  -1.665801 -0.742059 -1.354676
H  -3.864769 -2.134769 -0.373731
H  -3.962531 -0.40193 -0.67814
H  -4.472505 -1.055645 0.877285
H  1.747209 -4.371701 2.048158
H  2.990063 -4.073942 3.273429
H  3.390815 -3.954344 1.562358
H  3.155992 -0.357016 2.744217
H  4.25148 -1.527676 2.01016
H  3.798217 -1.699588 3.703175
H  -3.658739 2.786516 -1.094498
H  0.028262 3.945219 -2.937169
H  2.133827 3.04693 -0.31452
H  2.065728 1.626037 -1.338868
H  2.104917 3.229967 -2.066005
H  -3.73227 4.1183 -3.057001
H  -2.375101 3.95305 -4.168774
H  3.794509 -1.529655 -2.122926
H  2.459198 -1.11359 -3.144089
H  0.083954 1.465435 0.538834
H  -2.443461 5.317526 -3.070768
elementType: F O N C H
totalener: -1111.28269960 hartree
nucrepener: 2180.66119311 hartree
electener: -3291.94389271 hartree
oneelecener: -5848.66057369 hartree
twoeener: 2556.71668098 hartree
cpcmener: -0.03572827 hartree
kineticenergy: 1106.43945962 hartree
xcener: -106.880085597438 hartree
chargesum: -0.0000000
charge: -0.268377 -0.361316 -0.189980 -0.406266 -0.456577 -0.417805 -0.252362 0.167005 -0.021374 0.325438 -0.303133 0.245907 0.340415 0.261845 -0.311071 -0.298515 -0.225426 -0.264544 0.012984 0.031562 -0.250885 0.333587 -0.209232 -0.211263 0.073112 0.125132 0.110533 0.167685 0.105734 0.089637 0.095707 0.110226 0.105161 0.097066 0.108873 0.091473 0.104111 0.124056 0.126275 0.106206 0.085089 0.094212 0.092559 0.101371 0.192655 0.192878 0.126328 0.103303
qa: -0.2684 -0.3613 -0.1900 -0.4063 -0.4566 -0.4178 -0.2524 0.1670 -0.0214 0.3254 -0.3031 0.2459 0.3404 0.2618 -0.3111 -0.2985 -0.2254 -0.2645 0.0130 0.0316 -0.2509 0.3336 -0.2092 -0.2113 0.0731 0.1251 0.1105 0.1677 0.1057 0.0896 0.0957 0.1102 0.1052 0.0971 0.1089 0.0915 0.1041 0.1241 0.1263 0.1062 0.0851 0.0942 0.0926 0.1014 0.1927 0.1929 0.1263 0.1033
va: 0.9989 2.0223 3.1918 2.9711 2.9618 2.9678 3.2154 3.7566 3.8366 3.9156 3.9588 4.0053 4.2784 3.7967 3.9303 3.9303 3.8300 4.0101 3.7285 3.7432 3.9333 4.3361 3.8999 3.8944 1.0343 1.0014 1.0141 1.0229 1.0072 1.0040 1.0030 1.0076 1.0049 1.0136 1.0057 1.0202 1.0056 1.0206 1.0103 0.9960 1.0029 1.0060 1.0057 0.9961 1.0099 1.0092 1.0172 0.9944
dispcorr: -0.024892868 hartree
energy: -1111.307592465569
dipole: -1.34509 2.25461 0.90952 6.98177 -7.16733 -0.18556 -6.18930 4.75610 -1.43320
magnitude: 1.70755 au
magnitude: 4.34025 debye
