program: Orca
programVersion: 5.0.2
elementType: F O N N N N N C C C C C C C C C C C C C C C C C H H H H H H H H H H H H H H H H H H H H H H H H
charge: 0
multiplicity: 1
keywords: wb97x-d3
keywords: def2-TZVPP
keywords: def2/J RIJCOSX
keywords: DEFGRID2
keywords: scfconv7
keywords: smallprint printgap noloewdin
keywords: NOSOSCF
formula: C17H24FN5O
InChI: InChI=1/C17H24FN5O/c1-10-6-11(2)8-13(7-10)24-9-12(3)20-16-22-14(17(4,5)18)21-15(19)23-16/h6-8,12,20H,9,19H2,1-5H3
48 atoms
F  3.827754 -2.343611 1.274939
O  -2.098706 1.343976 0.220937
N  -1.660099 -2.176227 -0.625824
N  0.40738 -1.998932 0.358291
N  2.115677 -3.476127 -0.302146
N  -0.04542 -3.649558 -1.275795
N  1.632167 -5.085194 -1.849253
C  -2.199074 -1.023528 0.066707
C  -1.654586 0.254502 -0.56611
C  2.573298 -1.735501 1.342693
C  -3.715946 -1.089259 0.031824
C  1.642756 -2.469505 0.397949
C  -0.399221 -2.615725 -0.512374
C  -1.575174 2.572488 0.001139
C  2.737737 -0.292077 0.899368
C  2.083753 -1.84724 2.775099
C  -0.676346 2.867494 -1.013598
C  -1.996748 3.573784 0.879841
C  -0.182965 4.169323 -1.146965
C  -1.517654 4.865975 0.752294
C  -0.605633 5.153607 -0.267717
C  1.213821 -4.046125 -1.126201
C  0.802899 4.47553 -2.235456
C  -1.957389 5.944408 1.697033
H  -1.864294 -1.058958 1.105444
H  -0.561753 0.216379 -0.584947
H  -2.010362 0.348113 -1.599013
H  -2.233693 -2.621286 -1.325598
H  -4.155485 -0.246639 0.562187
H  -4.076539 -2.000441 0.508861
H  -4.087651 -1.070645 -0.99486
H  3.43355 0.227769 1.558588
H  1.784865 0.231885 0.935466
H  3.117555 -0.233095 -0.12144
H  2.779566 -1.34755 3.449824
H  1.991726 -2.889834 3.082354
H  1.110612 -1.374416 2.886793
H  -2.702451 3.325913 1.664293
H  -0.223845 6.163166 -0.372225
H  0.410323 4.20411 -3.216444
H  1.057701 5.534139 -2.258681
H  1.728818 3.914559 -2.097351
H  -1.118057 6.318076 2.285949
H  -2.716373 5.586819 2.391504
H  2.574364 -5.421429 -1.75412
H  1.000298 -5.56222 -2.468489
H  -0.344411 2.109409 -1.711851
H  -2.371097 6.798175 1.15863
elementType: F O N C H
totalener: -1111.28563975 hartree
nucrepener: 2073.72281889 hartree
electener: -3185.00845864 hartree
oneelecener: -5634.45795057 hartree
twoeener: 2449.44949193 hartree
cpcmener: -0.03688899 hartree
kineticenergy: 1106.44866352 hartree
xcener: -106.880301649510 hartree
chargesum: 0.0000000
charge: -0.266088 -0.342794 -0.211905 -0.479548 -0.397369 -0.441262 -0.247125 0.157297 -0.011295 0.337673 -0.281229 0.219772 0.388527 0.344345 -0.311211 -0.308537 -0.249901 -0.309372 -0.017316 0.040778 -0.255745 0.354029 -0.214354 -0.210995 0.063246 0.101614 0.112023 0.164922 0.091415 0.105995 0.091922 0.107431 0.092147 0.111913 0.104613 0.109465 0.096405 0.127014 0.126583 0.102373 0.090923 0.103427 0.103638 0.091824 0.193826 0.192876 0.126272 0.101756
qa: -0.2661 -0.3428 -0.2119 -0.4795 -0.3974 -0.4413 -0.2471 0.1573 -0.0113 0.3377 -0.2812 0.2198 0.3885 0.3443 -0.3112 -0.3085 -0.2499 -0.3094 -0.0173 0.0408 -0.2557 0.3540 -0.2144 -0.2110 0.0632 0.1016 0.1120 0.1649 0.0914 0.1060 0.0919 0.1074 0.0921 0.1119 0.1046 0.1095 0.0964 0.1270 0.1266 0.1024 0.0909 0.1034 0.1036 0.0918 0.1938 0.1929 0.1263 0.1018
va: 1.0043 2.0557 3.2008 2.9273 3.0179 2.9822 3.2063 3.8189 3.7970 3.9212 3.9209 4.0425 4.2366 3.7633 3.9368 3.9316 3.8514 4.0185 3.8138 3.7407 3.9277 4.3329 3.9008 3.8966 1.0361 0.9982 0.9993 1.0284 1.0161 1.0064 1.0026 1.0072 1.0047 1.0060 1.0055 1.0063 1.0135 1.0192 1.0104 0.9956 1.0054 0.9945 0.9943 1.0059 1.0087 1.0088 1.0176 0.9957
dispcorr: -0.020866780 hartree
energy: -1111.306506527452
dipole: -10.62661 9.48536 -1.14126 22.32919 -22.46152 -0.13233 1.51144 -2.56540 -1.05397
magnitude: 1.55911 au
magnitude: 3.96294 debye
