program: Orca
programVersion: 5.0.2
elementType: F O N N N N N C C C C C C C C C C C C C C C C C H H H H H H H H H H H H H H H H H H H H H H H H
charge: 0
multiplicity: 1
keywords: wb97x-d3
keywords: def2-TZVPP
keywords: def2/J RIJCOSX
keywords: DEFGRID2
keywords: scfconv7
keywords: smallprint printgap noloewdin
keywords: NOSOSCF
formula: C17H24FN5O
InChI: InChI=1/C17H24FN5O/c1-10-6-11(2)8-13(7-10)24-9-12(3)20-16-22-14(17(4,5)18)21-15(19)23-16/h6-8,12,20H,9,19H2,1-5H3
48 atoms
F  3.491596 -1.973218 1.86943
O  -1.335323 0.667917 0.139507
N  -1.827906 -2.003076 -0.487819
N  0.114518 -1.941074 0.756535
N  2.170779 -2.299958 -0.331026
N  0.141905 -2.417259 -1.558157
N  2.153595 -2.842975 -2.549038
C  -2.63665 -1.289319 0.482548
C  -2.669806 0.202869 0.174288
C  2.128713 -1.714409 2.032463
C  -4.049741 -1.845074 0.49384
C  1.432231 -2.021755 0.72172
C  -0.488073 -2.109405 -0.425481
C  -1.067381 1.930636 -0.25651
C  1.979406 -0.236599 2.352335
C  1.624754 -2.605089 3.151835
C  0.288331 2.231559 -0.415575
C  -2.031631 2.898638 -0.494389
C  0.68366 3.498071 -0.808233
C  -1.641213 4.181239 -0.892582
C  -0.293965 4.469243 -1.045757
C  1.463405 -2.516076 -1.455603
C  2.136279 3.832896 -0.97271
C  -2.687174 5.225885 -1.147229
H  -2.191213 -1.436199 1.465584
H  -3.162769 0.372824 -0.790817
H  -3.247943 0.724273 0.944904
H  -2.212568 -2.053167 -1.4211
H  -4.520435 -1.757252 -0.487387
H  -4.668234 -1.304511 1.21001
H  -4.050939 -2.896209 0.778821
H  2.49161 0.003704 3.284917
H  0.930036 0.029167 2.464839
H  2.400206 0.382022 1.557859
H  0.571138 -2.420366 3.347687
H  2.177574 -2.401155 4.069547
H  1.743577 -3.66046 2.903283
H  -3.086242 2.683546 -0.373044
H  0.007169 5.463976 -1.355101
H  2.767587 2.953378 -0.853101
H  2.336517 4.258792 -1.95672
H  2.45572 4.57254 -0.236514
H  -2.240338 6.178482 -1.428212
H  -3.30276 5.394432 -0.262337
H  3.157829 -2.8745 -2.522342
H  1.685699 -2.964613 -3.430261
H  1.026179 1.458609 -0.227852
H  -3.361621 4.924415 -1.950385
elementType: F O N C H
totalener: -1111.28508086 hartree
nucrepener: 2146.80211674 hartree
electener: -3258.08719760 hartree
oneelecener: -5781.46489779 hartree
twoeener: 2523.37770020 hartree
cpcmener: -0.04087580 hartree
kineticenergy: 1106.45644735 hartree
xcener: -106.880307030425 hartree
chargesum: 0.0000000
charge: -0.267367 -0.326424 -0.209400 -0.453201 -0.397136 -0.428828 -0.246728 0.165670 -0.025138 0.354034 -0.293879 0.211075 0.342989 0.350099 -0.332120 -0.301791 -0.305963 -0.265481 0.040299 -0.007650 -0.258942 0.353993 -0.218288 -0.215274 0.082291 0.105464 0.107500 0.157448 0.095968 0.094621 0.099000 0.112191 0.094404 0.107932 0.094609 0.104330 0.109193 0.126122 0.125176 0.091963 0.101912 0.103329 0.090762 0.102573 0.193324 0.192529 0.139269 0.103546
qa: -0.2674 -0.3264 -0.2094 -0.4532 -0.3971 -0.4288 -0.2467 0.1657 -0.0251 0.3540 -0.2939 0.2111 0.3430 0.3501 -0.3321 -0.3018 -0.3060 -0.2655 0.0403 -0.0076 -0.2589 0.3540 -0.2183 -0.2153 0.0823 0.1055 0.1075 0.1574 0.0960 0.0946 0.0990 0.1122 0.0944 0.1079 0.0946 0.1043 0.1092 0.1261 0.1252 0.0920 0.1019 0.1033 0.0908 0.1026 0.1933 0.1925 0.1393 0.1035
va: 1.0027 2.0646 3.1791 2.9277 3.0106 2.9664 3.2043 3.8365 3.8920 3.8975 3.9614 4.0446 4.3138 3.7846 3.9272 3.9319 3.9752 3.9170 3.7480 3.8208 3.9348 4.3299 3.9008 3.9008 1.0317 0.9941 0.9945 1.0294 1.0021 1.0043 1.0074 1.0092 1.0152 1.0083 1.0145 1.0061 1.0056 1.0173 1.0105 1.0056 0.9962 0.9942 1.0055 0.9951 1.0088 1.0091 1.0005 0.9944
dispcorr: -0.022724362 hartree
energy: -1111.307805221438
dipole: -14.84689 12.67254 -2.17435 16.59779 -15.98366 0.61413 2.55234 -3.40074 -0.84840
magnitude: 2.41345 au
magnitude: 6.13450 debye
