program: Orca
programVersion: 5.0.2
elementType: F O N N N N N C C C C C C C C C C C C C C C C C H H H H H H H H H H H H H H H H H H H H H H H H
charge: 0
multiplicity: 1
keywords: wb97x-d3
keywords: def2-TZVPP
keywords: def2/J RIJCOSX
keywords: DEFGRID2
keywords: scfconv7
keywords: smallprint printgap noloewdin
keywords: NOSOSCF
formula: C17H24FN5O
InChI: InChI=1/C17H24FN5O/c1-10-6-11(2)8-13(7-10)24-9-12(3)20-16-22-14(17(4,5)18)21-15(19)23-16/h6-8,12,20H,9,19H2,1-5H3
48 atoms
F  2.361835 -1.811891 2.523036
O  -2.044504 1.129511 0.079103
N  -1.573623 -1.696673 -0.055696
N  0.577789 -2.058729 0.675747
N  2.146618 -2.939625 -0.841361
N  -0.076163 -2.531607 -1.554141
N  1.482651 -3.40297 -2.977236
C  -1.984048 -0.998355 1.148363
C  -1.475104 0.434338 1.173659
C  2.855615 -2.493349 1.408981
C  -3.495002 -1.083952 1.287619
C  1.778616 -2.485916 0.341588
C  -0.322993 -2.099599 -0.318824
C  -1.645725 2.39791 -0.16792
C  3.144332 -3.92095 1.838308
C  4.102965 -1.763105 0.947883
C  -2.227701 3.011882 -1.280132
C  -0.720453 3.086984 0.603498
C  -1.883176 4.307089 -1.626759
C  -0.364884 4.394493 0.259668
C  -0.945403 4.9917 -0.848128
C  1.170625 -2.943272 -1.763793
C  -2.499992 4.972874 -2.820596
C  0.62748 5.135777 1.105797
H  -1.530836 -1.494084 2.007462
H  -1.755778 0.903812 2.123128
H  -0.383079 0.440718 1.108455
H  -2.197573 -1.651493 -0.846922
H  -3.819268 -0.556561 2.182848
H  -3.818023 -2.120086 1.376971
H  -4.012956 -0.645585 0.434927
H  2.239616 -4.419153 2.188817
H  3.879715 -3.931513 2.643689
H  3.548338 -4.498268 1.009156
H  4.560902 -2.272228 0.10361
H  4.834606 -1.729599 1.755475
H  3.876463 -0.740558 0.643962
H  -0.260544 2.634097 1.472711
H  -0.667687 6.005115 -1.116395
H  -3.210099 4.319088 -3.32489
H  -3.028799 5.883787 -2.535909
H  -1.739675 5.26289 -3.547578
H  1.515558 4.533431 1.300407
H  0.201004 5.395159 2.076603
H  2.434159 -3.643829 -3.193747
H  0.811254 -3.353693 -3.723668
H  -2.949385 2.460736 -1.872398
H  0.947158 6.061411 0.629153
elementType: F O N C H
totalener: -1111.28617154 hartree
nucrepener: 2076.02929656 hartree
electener: -3187.31546810 hartree
oneelecener: -5639.76566187 hartree
twoeener: 2452.45019376 hartree
cpcmener: -0.03544735 hartree
kineticenergy: 1106.45980337 hartree
xcener: -106.881969172824 hartree
chargesum: 0.0000000
charge: -0.267657 -0.345323 -0.216802 -0.427668 -0.464212 -0.440665 -0.256668 0.168160 -0.020956 0.328559 -0.291836 0.242647 0.395518 0.342315 -0.311491 -0.297722 -0.307389 -0.244254 0.039302 -0.021839 -0.255206 0.345320 -0.211639 -0.216088 0.075946 0.125061 0.108918 0.163978 0.092439 0.104492 0.091602 0.111210 0.104938 0.096519 0.090943 0.104126 0.109831 0.123123 0.125777 0.092623 0.102669 0.102429 0.100972 0.104397 0.192665 0.192808 0.126186 0.091941
qa: -0.2677 -0.3453 -0.2168 -0.4277 -0.4642 -0.4407 -0.2567 0.1682 -0.0210 0.3286 -0.2918 0.2426 0.3955 0.3423 -0.3115 -0.2977 -0.3074 -0.2443 0.0393 -0.0218 -0.2552 0.3453 -0.2116 -0.2161 0.0759 0.1251 0.1089 0.1640 0.0924 0.1045 0.0916 0.1112 0.1049 0.0965 0.0909 0.1041 0.1098 0.1231 0.1258 0.0926 0.1027 0.1024 0.1010 0.1044 0.1927 0.1928 0.1262 0.0919
va: 0.9996 2.0498 3.1980 2.9768 2.9580 2.9766 3.2104 3.8431 3.7860 3.9147 3.9443 4.0104 4.2268 3.7700 3.9333 3.9299 4.0167 3.8609 3.7373 3.8107 3.9291 4.3448 3.8961 3.8996 1.0313 0.9950 1.0096 1.0298 1.0049 1.0067 1.0096 1.0069 1.0054 1.0140 1.0196 1.0061 1.0051 1.0207 1.0102 1.0058 0.9951 0.9951 0.9968 0.9937 1.0094 1.0092 1.0196 1.0047
dispcorr: -0.020301272 hartree
energy: -1111.306472809281
dipole: -2.74819 2.89215 0.14395 13.72797 -13.95521 -0.22725 0.28726 -1.22298 -0.93572
magnitude: 0.97362 au
magnitude: 2.47475 debye
