program: Orca
programVersion: 5.0.2
elementType: F O N N N N N C C C C C C C C C C C C C C C C C H H H H H H H H H H H H H H H H H H H H H H H H
charge: 0
multiplicity: 1
keywords: wb97x-d3
keywords: def2-TZVPP
keywords: def2/J RIJCOSX
keywords: DEFGRID2
keywords: scfconv7
keywords: smallprint printgap noloewdin
keywords: NOSOSCF
formula: C17H24FN5O
InChI: InChI=1/C17H24FN5O/c1-10-6-11(2)8-13(7-10)24-9-12(3)20-16-22-14(17(4,5)18)21-15(19)23-16/h6-8,12,20H,9,19H2,1-5H3
48 atoms
F  2.702246 -2.673644 2.781332
O  -1.795357 1.596983 -0.035237
N  -0.683753 -1.028101 -0.050071
N  1.104537 -2.196664 0.81558
N  2.231982 -3.713272 -0.588688
N  0.386462 -2.485429 -1.42601
N  1.515101 -3.968959 -2.742673
C  -0.965517 -0.286948 1.162287
C  -0.826921 1.206775 0.922722
C  2.982981 -3.480676 1.67689
C  -2.326408 -0.663957 1.733734
C  2.036399 -3.091065 0.558926
C  0.294712 -1.924405 -0.220412
C  -1.875665 2.898512 -0.396509
C  2.738915 -4.921786 2.08901
C  4.426788 -3.231413 1.28112
C  -2.887222 3.21417 -1.307666
C  -1.0308 3.890262 0.079896
C  -3.059665 4.518319 -1.738929
C  -1.196616 5.210048 -0.351234
C  -2.204841 5.512399 -1.252828
C  1.370721 -3.368433 -1.559469
C  -4.146225 4.870598 -2.711482
C  -0.281896 6.276805 0.174542
H  -0.19649 -0.544688 1.888194
H  -0.97948 1.739522 1.867432
H  0.183183 1.434048 0.566616
H  -1.292477 -0.879207 -0.840574
H  -2.345581 -1.717763 2.009258
H  -3.132345 -0.491487 1.019906
H  -2.54024 -0.081152 2.629804
H  1.701542 -5.078049 2.387657
H  3.384131 -5.189493 2.926431
H  2.959366 -5.597978 1.265859
H  4.713127 -3.871311 0.44986
H  5.088536 -3.453405 2.11861
H  4.584726 -2.195049 0.980474
H  -0.240064 3.667626 0.785201
H  -2.334476 6.536019 -1.586705
H  -4.716186 3.993737 -3.015652
H  -4.84522 5.588245 -2.27901
H  -3.736647 5.331519 -3.611542
H  -0.488209 7.242562 -0.284743
H  0.764224 6.032628 -0.015311
H  2.285695 -4.594601 -2.900869
H  0.937248 -3.701328 -3.520403
H  -3.537517 2.426651 -1.671443
H  -0.389378 6.392581 1.254379
elementType: F O N C H
totalener: -1111.28569112 hartree
nucrepener: 2016.12926561 hartree
electener: -3127.41495673 hartree
oneelecener: -5519.65896394 hartree
twoeener: 2392.24400721 hartree
cpcmener: -0.03498886 hartree
kineticenergy: 1106.44760025 hartree
xcener: -106.880218194064 hartree
chargesum: 0.0000000
charge: -0.267542 -0.346703 -0.197529 -0.413770 -0.464593 -0.445170 -0.257691 0.114314 0.010990 0.338382 -0.285152 0.230408 0.400415 0.343481 -0.310479 -0.304641 -0.307359 -0.243999 0.040551 -0.017466 -0.257973 0.343116 -0.210338 -0.214987 0.080455 0.111110 0.111622 0.161108 0.098658 0.092383 0.091671 0.110331 0.104324 0.095282 0.092965 0.103855 0.110246 0.124936 0.126602 0.092443 0.102764 0.102259 0.091040 0.102458 0.192746 0.192501 0.128460 0.103517
qa: -0.2675 -0.3467 -0.1975 -0.4138 -0.4646 -0.4452 -0.2577 0.1143 0.0110 0.3384 -0.2852 0.2304 0.4004 0.3435 -0.3105 -0.3046 -0.3074 -0.2440 0.0406 -0.0175 -0.2580 0.3431 -0.2103 -0.2150 0.0805 0.1111 0.1116 0.1611 0.0987 0.0924 0.0917 0.1103 0.1043 0.0953 0.0930 0.1039 0.1102 0.1249 0.1266 0.0924 0.1028 0.1023 0.0910 0.1025 0.1927 0.1925 0.1285 0.1035
va: 1.0010 2.0561 3.2132 3.0061 2.9451 2.9660 3.2078 3.8569 3.8736 3.8936 3.9625 4.0468 4.2254 3.7655 3.9286 3.9288 4.0166 3.8650 3.7376 3.8177 3.9306 4.3488 3.8961 3.9004 1.0521 0.9938 0.9972 1.0371 1.0066 1.0091 1.0060 1.0068 1.0054 1.0155 1.0182 1.0063 1.0051 1.0192 1.0105 1.0058 0.9950 0.9952 1.0054 0.9954 1.0095 1.0093 1.0179 0.9945
dispcorr: -0.019704607 hartree
energy: -1111.305395727573
dipole: -6.33596 6.43467 0.09871 14.61395 -14.63138 -0.01743 -0.35792 -0.64176 -0.99968
magnitude: 1.00469 au
magnitude: 2.55372 debye
