program: Orca
programVersion: 5.0.2
elementType: F O N N N N N C C C C C C C C C C C C C C C C C H H H H H H H H H H H H H H H H H H H H H H H H
charge: 0
multiplicity: 1
keywords: wb97x-d3
keywords: def2-TZVPP
keywords: def2/J RIJCOSX
keywords: DEFGRID2
keywords: scfconv7
keywords: smallprint printgap noloewdin
keywords: NOSOSCF
formula: C17H24FN5O
InChI: InChI=1/C17H24FN5O/c1-10-6-11(2)8-13(7-10)24-9-12(3)20-16-22-14(17(4,5)18)21-15(19)23-16/h6-8,12,20H,9,19H2,1-5H3
48 atoms
F  1.90391 -2.461856 3.130178
O  -1.934045 1.289237 -0.399278
N  -1.078658 -1.437171 -0.393207
N  0.731129 -2.158772 0.841491
N  2.527692 -3.164047 -0.302584
N  0.662142 -2.36193 -1.521307
N  2.443509 -3.319841 -2.579497
C  -1.760405 -0.801823 0.716711
C  -1.4432 0.684556 0.783885
C  2.633025 -3.037468 2.087639
C  -3.254266 -1.078259 0.631261
C  1.907043 -2.751753 0.786782
C  0.139085 -1.993257 -0.35281
C  -1.768136 2.617784 -0.585316
C  2.680873 -4.534529 2.336434
C  4.01194 -2.405205 2.097246
C  -1.124484 3.456436 0.312828
C  -2.296585 3.133013 -1.772352
C  -1.007777 4.820723 0.028015
C  -2.187164 4.482035 -2.061719
C  -1.537982 5.320887 -1.150677
C  1.856942 -2.938783 -1.44351
C  -0.308903 5.72024 1.004107
C  -2.756476 5.044977 -3.329948
H  -1.376509 -1.236215 1.638546
H  -1.915851 1.120408 1.670863
H  -0.36123 0.830083 0.872462
H  -1.456368 -1.275564 -1.31479
H  -3.452445 -2.145999 0.712799
H  -3.68485 -0.731445 -0.3081
H  -3.780077 -0.579251 1.443987
H  1.680044 -4.968665 2.333584
H  3.144693 -4.742698 3.301353
H  3.267704 -5.032019 1.567447
H  3.956131 -1.328832 1.93166
H  4.640475 -2.834462 1.320951
H  4.497608 -2.582323 3.057408
H  -2.795439 2.464087 -2.464525
H  -1.448996 6.379142 -1.370333
H  -0.292568 6.752117 0.656182
H  -0.79895 5.705162 1.978977
H  0.723764 5.405983 1.16359
H  -3.202785 4.269494 -3.950921
H  -1.987608 5.544193 -3.921569
H  3.324355 -3.80299 -2.556692
H  1.966988 -3.219541 -3.458833
H  -0.706949 3.077642 1.237381
H  -3.527046 5.788592 -3.120317
elementType: F O N C H
totalener: -1111.28634965 hartree
nucrepener: 2040.08652725 hartree
electener: -3151.37287689 hartree
oneelecener: -5567.69098573 hartree
twoeener: 2416.31810884 hartree
cpcmener: -0.03538591 hartree
kineticenergy: 1106.44833192 hartree
xcener: -106.879802649612 hartree
chargesum: 0.0000000
charge: -0.268003 -0.344785 -0.209886 -0.420323 -0.463606 -0.444651 -0.256724 0.155026 -0.009935 0.336318 -0.290296 0.231253 0.400561 0.340774 -0.310263 -0.304466 -0.247220 -0.306116 -0.018138 0.040887 -0.256582 0.342967 -0.214167 -0.211237 0.080175 0.117466 0.109194 0.161391 0.100245 0.093062 0.091680 0.110292 0.104393 0.095927 0.110364 0.093136 0.103776 0.126908 0.126234 0.090535 0.102881 0.102985 0.092541 0.102163 0.193062 0.192742 0.124582 0.102878
qa: -0.2680 -0.3448 -0.2099 -0.4203 -0.4636 -0.4447 -0.2567 0.1550 -0.0099 0.3363 -0.2903 0.2313 0.4006 0.3408 -0.3103 -0.3045 -0.2472 -0.3061 -0.0181 0.0409 -0.2566 0.3430 -0.2142 -0.2112 0.0802 0.1175 0.1092 0.1614 0.1002 0.0931 0.0917 0.1103 0.1044 0.0959 0.1104 0.0931 0.1038 0.1269 0.1262 0.0905 0.1029 0.1030 0.0925 0.1022 0.1931 0.1927 0.1246 0.1029
va: 1.0007 2.0570 3.2034 2.9905 2.9457 2.9716 3.2104 3.8430 3.8624 3.9031 3.9551 4.0406 4.2171 3.7731 3.9291 3.9285 3.8652 4.0123 3.8157 3.7351 3.9287 4.3494 3.9001 3.8961 1.0420 0.9944 0.9979 1.0334 1.0074 1.0082 1.0054 1.0066 1.0057 1.0152 1.0051 1.0187 1.0058 1.0191 1.0105 1.0055 0.9950 0.9950 1.0058 0.9954 1.0093 1.0090 1.0198 0.9948
dispcorr: -0.019907824 hartree
energy: -1111.306257471439
dipole: -5.19169 5.52515 0.33346 14.19028 -14.32401 -0.13372 -0.73331 -0.19306 -0.92637
magnitude: 0.99360 au
magnitude: 2.52552 debye
