program: Orca
programVersion: 5.0.2
elementType: F O N N N N N C C C C C C C C C C C C C C C C C H H H H H H H H H H H H H H H H H H H H H H H H
charge: 0
multiplicity: 1
keywords: wb97x-d3
keywords: def2-TZVPP
keywords: def2/J RIJCOSX
keywords: DEFGRID2
keywords: scfconv7
keywords: smallprint printgap noloewdin
keywords: NOSOSCF
formula: C17H24FN5O
InChI: InChI=1/C17H24FN5O/c1-10-6-11(2)8-13(7-10)24-9-12(3)20-16-22-14(17(4,5)18)21-15(19)23-16/h6-8,12,20H,9,19H2,1-5H3
48 atoms
F  2.909216 -1.906989 1.865774
O  -2.783007 0.862688 -0.964373
N  -2.089283 -1.673943 -0.077033
N  0.034332 -1.151883 0.659329
N  1.857206 -1.569659 -0.762588
N  -0.338151 -2.117094 -1.4693
N  1.465361 -2.46841 -2.825059
C  -2.782401 -0.805194 0.854452
C  -3.535253 0.290255 0.09165
C  2.295724 -0.703875 1.447497
C  -3.761071 -1.577773 1.7231
C  1.318652 -1.151923 0.367477
C  -0.764919 -1.630049 -0.307658
C  -1.61495 1.502563 -0.681849
C  3.378995 0.198934 0.896421
C  1.629987 -0.091138 2.658117
C  -0.631255 1.444122 -1.66426
C  -1.386001 2.197836 0.499531
C  0.592765 2.07061 -1.470127
C  -0.166706 2.841458 0.700583
C  0.812549 2.769746 -0.285024
C  0.977187 -2.044882 -1.65815
C  1.678757 1.937133 -2.495022
C  0.077369 3.615902 1.961767
H  -2.028574 -0.351982 1.49556
H  -4.413528 -0.138225 -0.395301
H  -3.89571 1.045611 0.796383
H  -2.638027 -2.010352 -0.856356
H  -3.23924 -2.307641 2.341162
H  -4.496565 -2.10754 1.114744
H  -4.300833 -0.902938 2.388324
H  2.942153 1.127686 0.528601
H  3.920119 -0.267747 0.075581
H  4.090323 0.456264 1.682191
H  2.384235 0.147188 3.408883
H  0.894389 -0.755857 3.106972
H  1.126342 0.837637 2.391103
H  -2.142409 2.247973 1.273571
H  1.765978 3.261546 -0.125402
H  2.372031 2.77691 -2.460599
H  2.260688 1.028922 -2.321229
H  1.274682 1.871132 -3.505017
H  -0.244973 4.65377 1.851487
H  1.135462 3.634325 2.221591
H  2.458494 -2.488636 -2.978934
H  0.859122 -2.887066 -3.509077
H  -0.820874 0.890215 -2.576508
H  -0.472147 3.197229 2.804391
elementType: F O N C H
totalener: -1111.28014589 hartree
nucrepener: 2288.56836154 hartree
electener: -3399.84850743 hartree
oneelecener: -6064.94323687 hartree
twoeener: 2665.09472944 hartree
cpcmener: -0.03865884 hartree
kineticenergy: 1106.44933389 hartree
xcener: -106.882059056202 hartree
chargesum: 0.0000000
charge: -0.279238 -0.366548 -0.178604 -0.382433 -0.397991 -0.410731 -0.250504 0.096837 -0.005567 0.368466 -0.282069 0.145525 0.309203 0.297371 -0.308600 -0.277050 -0.250069 -0.214179 0.038424 -0.000636 -0.284122 0.344858 -0.221072 -0.223074 0.096349 0.118935 0.107329 0.157268 0.096537 0.092983 0.095340 0.097743 0.100649 0.110569 0.109105 0.099497 0.068132 0.132313 0.129738 0.105122 0.090069 0.106768 0.116691 0.097000 0.194352 0.192013 0.117568 0.099727
qa: -0.2792 -0.3665 -0.1786 -0.3824 -0.3980 -0.4107 -0.2505 0.0968 -0.0056 0.3685 -0.2821 0.1455 0.3092 0.2974 -0.3086 -0.2770 -0.2501 -0.2142 0.0384 -0.0006 -0.2841 0.3449 -0.2211 -0.2231 0.0963 0.1189 0.1073 0.1573 0.0965 0.0930 0.0953 0.0977 0.1006 0.1106 0.1091 0.0995 0.0681 0.1323 0.1297 0.1051 0.0901 0.1068 0.1167 0.0970 0.1944 0.1920 0.1176 0.0997
va: 0.9825 2.0339 3.1857 2.9534 2.9835 2.9622 3.2115 3.7796 3.9001 3.8110 3.9751 4.1437 4.3315 3.7252 3.8969 3.9234 3.9585 3.8061 3.6580 3.6574 3.8700 4.3114 3.8865 3.8808 1.0265 0.9970 0.9949 1.0316 1.0064 1.0045 1.0039 1.0028 1.0277 1.0086 1.0084 1.0210 1.0135 1.0094 1.0057 1.0025 1.0015 1.0018 0.9950 1.0005 1.0080 1.0098 1.0294 0.9997
dispcorr: -0.029872875 hartree
energy: -1111.310018761215
dipole: -3.86286 2.76857 -1.09429 14.19094 -13.55687 0.63408 6.58268 -6.92297 -0.34029
magnitude: 1.30970 au
magnitude: 3.32900 debye
