program: Orca
programVersion: 5.0.2
elementType: F O N N N N N C C C C C C C C C C C C C C C C C H H H H H H H H H H H H H H H H H H H H H H H H
charge: 0
multiplicity: 1
keywords: wb97x-d3
keywords: def2-TZVPP
keywords: def2/J RIJCOSX
keywords: DEFGRID2
keywords: scfconv7
keywords: smallprint printgap noloewdin
keywords: NOSOSCF
formula: C17H24FN5O
InChI: InChI=1/C17H24FN5O/c1-10-6-11(2)8-13(7-10)24-9-12(3)20-16-22-14(17(4,5)18)21-15(19)23-16/h6-8,12,20H,9,19H2,1-5H3
48 atoms
F  3.833698 -2.2962 0.783756
O  -2.912492 1.585972 -0.374815
N  -1.764061 -1.91646 -0.366521
N  0.494732 -1.647728 -0.024044
N  1.960479 -3.336259 -0.753346
N  -0.370298 -3.534389 -1.160558
N  1.099121 -5.119915 -1.889829
C  -2.132373 -0.656075 0.242517
C  -2.56513 0.305051 -0.867942
C  2.865304 -1.380567 0.350699
C  -3.225023 -0.864619 1.278025
C  1.688994 -2.189484 -0.165148
C  -0.51534 -2.372931 -0.525348
C  -1.93968 2.46932 -0.031792
C  3.457122 -0.579525 -0.796098
C  2.513988 -0.501892 1.532724
C  -2.379028 3.637712 0.584283
C  -0.582289 2.283572 -0.28295
C  -1.474358 4.628677 0.945771
C  0.332383 3.271461 0.073513
C  -0.120548 4.437976 0.681614
C  0.88323 -3.968899 -1.252396
C  -1.957312 5.873806 1.629745
C  1.796472 3.0661 -0.183205
H  -1.244497 -0.263514 0.735949
H  -1.793296 0.368347 -1.64084
H  -3.46953 -0.076953 -1.346395
H  -2.506114 -2.478425 -0.757221
H  -4.118668 -1.30217 0.827933
H  -3.511351 0.077957 1.743076
H  -2.881401 -1.529515 2.07003
H  3.792112 -1.229456 -1.604776
H  4.306366 0.011801 -0.45116
H  2.714952 0.107307 -1.202295
H  2.09655 -1.082259 2.355776
H  1.786912 0.257046 1.253166
H  3.408744 0.009686 1.888749
H  -0.211031 1.385541 -0.758749
H  0.59071 5.21029 0.952356
H  -2.162251 5.685133 2.685457
H  -1.216825 6.671177 1.579601
H  -2.882256 6.242756 1.186402
H  2.269855 3.980286 -0.54229
H  1.968505 2.285325 -0.923227
H  2.029881 -5.491063 -1.966652
H  0.331631 -5.644525 -2.271884
H  -3.438124 3.772463 0.773538
H  2.319866 2.771834 0.729106
elementType: F O N C H
totalener: -1111.28318271 hartree
nucrepener: 2123.13112483 hartree
electener: -3234.41430754 hartree
oneelecener: -5732.96656866 hartree
twoeener: 2498.55226112 hartree
cpcmener: -0.03803544 hartree
kineticenergy: 1106.44118242 hartree
xcener: -106.879768429286 hartree
chargesum: -0.0000000
charge: -0.271321 -0.354890 -0.197831 -0.446124 -0.417572 -0.441820 -0.247850 0.089625 0.012047 0.337496 -0.283286 0.216466 0.389990 0.329837 -0.327839 -0.285626 -0.314526 -0.237729 0.045107 0.027112 -0.262149 0.349754 -0.210644 -0.274895 0.094519 0.112483 0.128391 0.163009 0.095435 0.089907 0.098619 0.110722 0.110916 0.097456 0.112751 0.065883 0.112080 0.124061 0.125015 0.103772 0.093746 0.098895 0.113593 0.109846 0.193191 0.192636 0.121640 0.108099
qa: -0.2713 -0.3549 -0.1978 -0.4461 -0.4176 -0.4418 -0.2478 0.0896 0.0120 0.3375 -0.2833 0.2165 0.3900 0.3298 -0.3278 -0.2856 -0.3145 -0.2377 0.0451 0.0271 -0.2621 0.3498 -0.2106 -0.2749 0.0945 0.1125 0.1284 0.1630 0.0954 0.0899 0.0986 0.1107 0.1109 0.0975 0.1128 0.0659 0.1121 0.1241 0.1250 0.1038 0.0937 0.0989 0.1136 0.1098 0.1932 0.1926 0.1216 0.1081
va: 0.9971 2.0511 3.1963 2.9674 3.0226 2.9715 3.2057 3.7598 3.8678 3.8867 3.9533 4.0843 4.2384 3.7807 3.9199 3.9279 4.0545 3.8170 3.7337 3.6675 3.9631 4.3399 3.8936 3.9089 1.0280 1.0026 0.9942 1.0283 1.0023 1.0127 1.0075 1.0192 1.0029 1.0079 1.0141 1.0122 1.0059 1.0234 1.0104 0.9937 1.0039 0.9990 1.0015 0.9937 1.0090 1.0091 1.0225 0.9894
dispcorr: -0.023774783 hartree
energy: -1111.306957491721
dipole: -5.55436 4.58487 -0.96949 21.00702 -21.20433 -0.19731 4.61466 -5.37310 -0.75844
magnitude: 1.24663 au
magnitude: 3.16867 debye
