program: Orca
programVersion: 5.0.2
elementType: F O N N N N N C C C C C C C C C C C C C C C C C H H H H H H H H H H H H H H H H H H H H H H H H
charge: 0
multiplicity: 1
keywords: wb97x-d3
keywords: def2-TZVPP
keywords: def2/J RIJCOSX
keywords: DEFGRID2
keywords: scfconv7
keywords: smallprint printgap noloewdin
keywords: NOSOSCF
formula: C17H24FN5O
InChI: InChI=1/C17H24FN5O/c1-10-6-11(2)8-13(7-10)24-9-12(3)20-16-22-14(17(4,5)18)21-15(19)23-16/h6-8,12,20H,9,19H2,1-5H3
48 atoms
F  4.039942 -1.945139 -0.272252
O  -2.624249 1.548469 -0.59978
N  -1.766939 -2.018597 -0.174412
N  0.499959 -1.622902 -0.14635
N  1.952378 -3.339295 -0.841998
N  -0.391559 -3.693558 -0.867942
N  1.059548 -5.314687 -1.559484
C  -2.132301 -0.6968 0.291532
C  -2.160339 0.251076 -0.913692
C  2.866756 -1.210257 -0.105671
C  -3.475864 -0.769354 0.997716
C  1.697182 -2.135956 -0.381569
C  -0.520368 -2.451167 -0.402751
C  -1.80909 2.448735 -0.003571
C  2.885543 -0.07938 -1.119462
C  2.837828 -0.701807 1.323913
C  -2.393694 3.690227 0.258859
C  -0.481825 2.219522 0.333209
C  -1.662508 4.701199 0.858272
C  0.264519 3.234633 0.939791
C  -0.3283 4.46146 1.19617
C  0.858699 -4.087742 -1.076848
C  -2.284142 6.036989 1.140305
C  1.691427 2.976915 1.327247
H  -1.376551 -0.368562 1.007059
H  -1.178558 0.285969 -1.397052
H  -2.869435 -0.138122 -1.647674
H  -2.510172 -2.656379 -0.417054
H  -3.432217 -1.467969 1.833412
H  -4.267347 -1.098029 0.319936
H  -3.761915 0.201614 1.398685
H  2.934716 -0.462648 -2.139886
H  3.750891 0.563551 -0.953468
H  1.988942 0.531822 -1.032272
H  2.852845 -1.523958 2.040204
H  1.939934 -0.116246 1.504157
H  3.701714 -0.064818 1.515245
H  -0.006161 1.26396 0.144312
H  0.252184 5.247675 1.666809
H  -2.251963 6.271454 2.205853
H  -1.752841 6.838242 0.623637
H  -3.326176 6.072723 0.824436
H  2.250249 2.505782 0.517646
H  1.751717 2.308735 2.189032
H  1.994381 -5.652815 -1.708715
H  0.282538 -5.927424 -1.736796
H  -3.429855 3.852917 -0.015945
H  2.205771 3.899562 1.594856
elementType: F O N C H
totalener: -1111.29587240 hartree
nucrepener: 2128.16036747 hartree
electener: -3239.45623987 hartree
oneelecener: -5742.86281308 hartree
twoeener: 2503.40657321 hartree
cpcmener: -0.03180298 hartree
kineticenergy: 1106.43749840 hartree
xcener: -106.880077173277 hartree
chargesum: 0.0000000
charge: -0.261084 -0.335925 -0.202885 -0.467849 -0.388062 -0.437120 -0.247412 0.091340 0.011720 0.388513 -0.292578 0.204225 0.385832 0.314635 -0.339206 -0.332018 -0.294187 -0.205320 0.042265 0.042695 -0.253798 0.350170 -0.213470 -0.269891 0.092136 0.112096 0.121197 0.163846 0.104976 0.093838 0.093374 0.118807 0.109345 0.089428 0.117271 0.084726 0.110108 0.064894 0.122304 0.101875 0.101693 0.091134 0.103981 0.108563 0.191735 0.189568 0.119628 0.102889
qa: -0.2611 -0.3359 -0.2029 -0.4678 -0.3881 -0.4371 -0.2474 0.0913 0.0117 0.3885 -0.2926 0.2042 0.3858 0.3146 -0.3392 -0.3320 -0.2942 -0.2053 0.0423 0.0427 -0.2538 0.3502 -0.2135 -0.2699 0.0921 0.1121 0.1212 0.1638 0.1050 0.0938 0.0934 0.1188 0.1093 0.0894 0.1173 0.0847 0.1101 0.0649 0.1223 0.1019 0.1017 0.0911 0.1040 0.1086 0.1917 0.1896 0.1196 0.1029
va: 1.0118 2.0649 3.1754 2.9472 3.0146 2.9821 3.2008 3.7529 3.7886 3.8370 3.9472 4.0775 4.2414 3.8075 3.9414 3.9544 4.0339 3.8311 3.7641 3.6583 3.9477 4.3410 3.8967 3.9055 1.0137 1.0120 1.0006 1.0301 1.0071 1.0012 1.0103 1.0127 1.0027 0.9978 1.0103 1.0055 1.0020 1.0399 1.0121 0.9951 0.9952 1.0061 0.9913 0.9885 1.0101 1.0109 1.0240 1.0086
dispcorr: -0.024311831 hartree
energy: -1111.320184229029
dipole: -7.74445 6.64192 -1.10253 20.89375 -21.35041 -0.45665 8.08617 -8.03881 0.04736
magnitude: 1.19429 au
magnitude: 3.03565 debye
