program: Orca
programVersion: 5.0.2
elementType: F O N N N N N C C C C C C C C C C C C C C C C C H H H H H H H H H H H H H H H H H H H H H H H H
charge: 0
multiplicity: 1
keywords: wb97x-d3
keywords: def2-TZVPP
keywords: def2/J RIJCOSX
keywords: DEFGRID2
keywords: scfconv7
keywords: smallprint printgap noloewdin
keywords: NOSOSCF
formula: C17H24FN5O
InChI: InChI=1/C17H24FN5O/c1-10-6-11(2)8-13(7-10)24-9-12(3)20-16-22-14(17(4,5)18)21-15(19)23-16/h6-8,12,20H,9,19H2,1-5H3
48 atoms
F  3.284117 -1.577378 1.454935
O  -2.133838 0.919852 -1.196462
N  -2.033787 -1.877406 -0.466265
N  0.081585 -1.281196 0.231849
N  1.926874 -2.408754 -0.694397
N  -0.266906 -2.972191 -1.386962
N  1.557257 -4.027889 -2.263589
C  -2.740819 -0.897952 0.330983
C  -3.202344 0.268748 -0.538771
C  2.329053 -0.683568 0.940787
C  -3.940781 -1.54236 1.008583
C  1.37141 -1.522371 0.107881
C  -0.708131 -2.040683 -0.543828
C  -1.353869 1.797998 -0.527179
C  3.057176 0.30129 0.045737
C  1.664556 0.003134 2.113302
C  -0.245009 2.269717 -1.233478
C  -1.595169 2.24997 0.763274
C  0.61269 3.195764 -0.663542
C  -0.737189 3.185574 1.346967
C  0.357077 3.64916 0.633019
C  1.053435 -3.117078 -1.428193
C  1.798945 3.711484 -1.422756
C  -0.99887 3.650038 2.749336
H  -2.053555 -0.538443 1.096979
H  -3.846159 -0.108073 -1.33686
H  -3.803167 0.970053 0.048594
H  -2.584005 -2.455205 -1.084981
H  -3.625887 -2.35863 1.658282
H  -4.645925 -1.94336 0.277373
H  -4.475044 -0.815826 1.621253
H  2.34855 0.988345 -0.417276
H  3.599676 -0.210026 -0.749675
H  3.76615 0.895276 0.624932
H  1.149231 -0.704341 2.763188
H  0.936184 0.736925 1.772212
H  2.414607 0.530721 2.704004
H  -2.440193 1.894211 1.339363
H  1.025793 4.371868 1.087698
H  1.641827 4.743987 -1.742855
H  2.699858 3.704017 -0.807691
H  1.996914 3.119613 -2.315825
H  -0.350252 4.480658 3.025656
H  -0.827447 2.845332 3.467753
H  2.548689 -4.18971 -2.298886
H  0.949914 -4.611126 -2.812706
H  -0.062716 1.901272 -2.236853
H  -2.032214 3.976153 2.877732
elementType: F O N C H
totalener: -1111.29581216 hartree
nucrepener: 2213.70484595 hartree
electener: -3325.00065811 hartree
oneelecener: -5915.14141796 hartree
twoeener: 2590.14075985 hartree
cpcmener: -0.03540874 hartree
kineticenergy: 1106.43785305 hartree
xcener: -106.880319841099 hartree
chargesum: -0.0000000
charge: -0.271203 -0.331516 -0.180571 -0.425121 -0.416464 -0.437740 -0.252240 0.092418 -0.010836 0.327067 -0.282423 0.203348 0.383987 0.317772 -0.289185 -0.247989 -0.283286 -0.213731 0.012029 -0.019605 -0.224720 0.347541 -0.222007 -0.224566 0.091717 0.126015 0.101926 0.155464 0.100413 0.096500 0.094114 0.069196 0.107011 0.107361 0.106892 0.036581 0.108501 0.121291 0.120083 0.115013 0.099614 0.096955 0.091030 0.103409 0.190279 0.188567 0.117848 0.103261
qa: -0.2712 -0.3315 -0.1806 -0.4251 -0.4165 -0.4377 -0.2522 0.0924 -0.0108 0.3271 -0.2824 0.2033 0.3840 0.3178 -0.2892 -0.2480 -0.2833 -0.2137 0.0120 -0.0196 -0.2247 0.3475 -0.2220 -0.2246 0.0917 0.1260 0.1019 0.1555 0.1004 0.0965 0.0941 0.0692 0.1070 0.1074 0.1069 0.0366 0.1085 0.1213 0.1201 0.1150 0.0996 0.0970 0.0910 0.1034 0.1903 0.1886 0.1178 0.1033
va: 0.9992 2.0596 3.1694 2.9598 3.0278 2.9772 3.1995 3.7902 3.9176 3.8839 3.9649 4.1105 4.2437 3.7160 3.9060 3.9024 3.9537 3.7886 3.6957 3.7622 3.8777 4.3382 3.8778 3.9012 1.0259 0.9980 1.0004 1.0321 1.0061 1.0019 1.0044 1.0133 1.0258 1.0062 1.0183 1.0310 1.0098 1.0137 1.0108 0.9961 0.9972 1.0028 1.0054 0.9922 1.0110 1.0117 1.0234 0.9971
dispcorr: -0.026265190 hartree
energy: -1111.322077350141
dipole: -8.44366 6.63510 -1.80856 17.56574 -17.51484 0.05090 6.82208 -7.08347 -0.26138
magnitude: 1.82806 au
magnitude: 4.64656 debye
