program: Orca
programVersion: 5.0.2
elementType: F O N N N N N C C C C C C C C C C C C C C C C C H H H H H H H H H H H H H H H H H H H H H H H H
charge: 0
multiplicity: 1
keywords: wb97x-d3
keywords: def2-TZVPP
keywords: def2/J RIJCOSX
keywords: DEFGRID2
keywords: scfconv7
keywords: smallprint printgap noloewdin
keywords: NOSOSCF
formula: C17H24FN5O
InChI: InChI=1/C17H24FN5O/c1-10-6-11(2)8-13(7-10)24-9-12(3)20-16-22-14(17(4,5)18)21-15(19)23-16/h6-8,12,20H,9,19H2,1-5H3
48 atoms
F  3.974597 -1.811848 0.75813
O  -1.963383 1.391113 0.435715
N  -1.458835 -2.047585 -0.668752
N  0.598726 -2.071256 0.351988
N  2.266189 -3.495489 -0.494275
N  0.127621 -3.45212 -1.512058
N  1.783027 -4.8169 -2.294245
C  -1.974924 -0.976489 0.1601
C  -1.51238 0.358316 -0.417657
C  2.781101 -2.132135 1.426004
C  -3.488236 -1.088022 0.234187
C  1.810141 -2.590284 0.348081
C  -0.213267 -2.536841 -0.609838
C  -1.662806 2.670974 0.126852
C  2.325055 -0.894075 2.165401
C  3.074529 -3.280731 2.371839
C  -0.946745 3.052979 -0.999151
C  -2.119694 3.638081 1.026966
C  -0.6834 4.406321 -1.232011
C  -1.863005 4.98026 0.805606
C  -1.140415 5.3549 -0.331526
C  1.376496 -3.899616 -1.415171
C  0.084199 4.807852 -2.457213
C  -2.344692 6.026246 1.767196
H  -1.555536 -1.088967 1.161737
H  -0.41921 0.370225 -0.486962
H  -1.918129 0.480749 -1.429581
H  -2.027938 -2.365714 -1.439702
H  -3.783737 -2.052964 0.647214
H  -3.943494 -0.987147 -0.754068
H  -3.907751 -0.314074 0.874878
H  2.129186 -0.061572 1.4898
H  3.094715 -0.587672 2.875283
H  1.414345 -1.08964 2.728105
H  3.797148 -2.976494 3.130418
H  3.472127 -4.14299 1.83738
H  2.165086 -3.593091 2.886235
H  -2.676915 3.323731 1.902224
H  -0.934462 6.404701 -0.510092
H  0.299276 5.875849 -2.464347
H  1.03472 4.276054 -2.52526
H  -0.473648 4.577738 -3.367187
H  -2.909065 5.590116 2.590734
H  -2.989565 6.753976 1.271372
H  2.718556 -5.182014 -2.250266
H  1.158481 -5.157086 -3.004656
H  -0.581265 2.321926 -1.709379
H  -1.509544 6.583613 2.195434
elementType: F O N C H
totalener: -1111.29742021 hartree
nucrepener: 2048.97849826 hartree
electener: -3160.27591847 hartree
oneelecener: -5584.99602193 hartree
twoeener: 2424.72010346 hartree
cpcmener: -0.03219456 hartree
kineticenergy: 1106.43545522 hartree
xcener: -106.875323253305 hartree
chargesum: -0.0000000
charge: -0.272517 -0.328592 -0.215203 -0.431911 -0.416900 -0.435550 -0.251826 0.165227 -0.030524 0.314116 -0.273673 0.207850 0.393151 0.345070 -0.287226 -0.298317 -0.237212 -0.304826 -0.027150 0.039945 -0.247091 0.350801 -0.217438 -0.214151 0.068858 0.110181 0.106322 0.162080 0.103559 0.089638 0.091729 0.102589 0.105893 0.089276 0.102156 0.101798 0.101790 0.124198 0.121610 0.089946 0.101728 0.103200 0.091114 0.102108 0.191800 0.189776 0.119941 0.102655
qa: -0.2725 -0.3286 -0.2152 -0.4319 -0.4169 -0.4356 -0.2518 0.1652 -0.0305 0.3141 -0.2737 0.2078 0.3932 0.3451 -0.2872 -0.2983 -0.2372 -0.3048 -0.0271 0.0399 -0.2471 0.3508 -0.2174 -0.2142 0.0689 0.1102 0.1063 0.1621 0.1036 0.0896 0.0917 0.1026 0.1059 0.0893 0.1022 0.1018 0.1018 0.1242 0.1216 0.0899 0.1017 0.1032 0.0911 0.1021 0.1918 0.1898 0.1199 0.1027
va: 0.9946 2.0736 3.1994 2.9687 3.0117 2.9855 3.2041 3.8145 3.8312 3.8837 3.9176 4.1084 4.2191 3.7782 3.9357 3.9183 3.8475 4.0227 3.8342 3.7459 3.9316 4.3333 3.9023 3.8980 1.0348 0.9994 0.9962 1.0305 1.0070 1.0031 1.0163 1.0114 1.0069 1.0109 1.0063 1.0215 1.0047 1.0199 1.0113 1.0056 0.9958 0.9941 1.0063 0.9951 1.0102 1.0110 1.0214 0.9947
dispcorr: -0.020241134 hartree
energy: -1111.317661347596
dipole: -11.78955 10.58600 -1.20355 17.68992 -18.34389 -0.65397 4.70438 -5.47230 -0.76793
magnitude: 1.57032 au
magnitude: 3.99144 debye
