program: Orca
programVersion: 5.0.2
elementType: F O N N N N N C C C C C C C C C C C C C C C C C H H H H H H H H H H H H H H H H H H H H H H H H
charge: 0
multiplicity: 1
keywords: wb97x-d3
keywords: def2-TZVPP
keywords: def2/J RIJCOSX
keywords: DEFGRID2
keywords: scfconv7
keywords: smallprint printgap noloewdin
keywords: NOSOSCF
formula: C17H24FN5O
InChI: InChI=1/C17H24FN5O/c1-10-6-11(2)8-13(7-10)24-9-12(3)20-16-22-14(17(4,5)18)21-15(19)23-16/h6-8,12,20H,9,19H2,1-5H3
48 atoms
F  4.018499 -3.15263 1.157025
O  -1.731398 1.589885 0.537153
N  -1.378825 -1.864433 -0.555653
N  0.706366 -2.123878 0.37805
N  2.159852 -3.738147 -0.526215
N  0.00443 -3.428621 -1.466375
N  1.463482 -4.962081 -2.323043
C  -1.768874 -0.780154 0.320103
C  -1.430227 0.542631 -0.362193
C  2.845988 -2.443995 1.416746
C  -3.247657 -0.897564 0.651162
C  1.843792 -2.79725 0.3345
C  -0.190988 -2.484352 -0.546398
C  -1.586278 2.869461 0.129211
C  3.184274 -0.964307 1.400025
C  2.322933 -2.894018 2.770675
C  -1.880092 3.846851 1.084043
C  -1.175791 3.241013 -1.142864
C  -1.768155 5.190373 0.770756
C  -1.065852 4.596069 -1.470733
C  -1.361352 5.555751 -0.515964
C  1.193918 -4.017487 -1.420833
C  -2.07469 6.246642 1.791029
C  -0.632981 4.987127 -2.853135
H  -1.183676 -0.863034 1.236725
H  -0.367966 0.562773 -0.630449
H  -2.014529 0.63534 -1.285899
H  -2.023091 -2.142166 -1.280736
H  -3.459841 -1.853519 1.130444
H  -3.863419 -0.823294 -0.248312
H  -3.562002 -0.110224 1.334715
H  3.94408 -0.745083 2.150702
H  2.305164 -0.366004 1.62872
H  3.56328 -0.649051 0.427051
H  3.059399 -2.689227 3.548853
H  2.10443 -3.962976 2.777997
H  1.408225 -2.361706 3.025026
H  -0.936976 2.501392 -1.897063
H  -1.273802 6.606833 -0.76928
H  -2.355363 5.813099 2.75023
H  -1.213265 6.895499 1.95953
H  -2.894981 6.888449 1.464165
H  -1.33246 4.620642 -3.607036
H  0.34471 4.56819 -3.098217
H  2.352928 -5.430496 -2.3143
H  0.780092 -5.217186 -3.014874
H  -2.195187 3.539418 2.074928
H  -0.567201 6.069083 -2.962828
elementType: F O N C H
totalener: -1111.29828054 hartree
nucrepener: 2033.29295841 hartree
electener: -3144.59123896 hartree
oneelecener: -5553.45529154 hartree
twoeener: 2408.86405258 hartree
cpcmener: -0.03269427 hartree
kineticenergy: 1106.43932154 hartree
xcener: -106.877234288619 hartree
chargesum: 0.0000000
charge: -0.262098 -0.328761 -0.219252 -0.476558 -0.388938 -0.438036 -0.248839 0.159521 -0.036057 0.337598 -0.267248 0.215273 0.394592 0.347187 -0.303578 -0.312679 -0.306001 -0.237636 0.042456 -0.025710 -0.249430 0.353319 -0.212643 -0.217570 0.073649 0.111884 0.103760 0.160468 0.101100 0.089445 0.090248 0.103435 0.093061 0.108860 0.103713 0.109546 0.096252 0.118542 0.122889 0.091212 0.101677 0.102332 0.102456 0.102605 0.192115 0.189393 0.122798 0.089645
qa: -0.2621 -0.3288 -0.2193 -0.4766 -0.3889 -0.4380 -0.2488 0.1595 -0.0361 0.3376 -0.2672 0.2153 0.3946 0.3472 -0.3036 -0.3127 -0.3060 -0.2376 0.0425 -0.0257 -0.2494 0.3533 -0.2126 -0.2176 0.0736 0.1119 0.1038 0.1605 0.1011 0.0894 0.0902 0.1034 0.0931 0.1089 0.1037 0.1095 0.0963 0.1185 0.1229 0.0912 0.1017 0.1023 0.1025 0.1026 0.1921 0.1894 0.1228 0.0896
va: 1.0087 2.0709 3.2025 2.9394 3.0151 2.9828 3.2022 3.8163 3.8788 3.9155 3.9160 4.0552 4.2265 3.7743 3.9337 3.9329 4.0231 3.8528 3.7435 3.8302 3.9325 4.3339 3.8974 3.9021 1.0402 0.9999 0.9946 1.0317 1.0076 1.0036 1.0166 1.0065 1.0137 1.0058 1.0054 1.0077 1.0115 1.0222 1.0110 1.0062 0.9952 0.9947 0.9945 0.9952 1.0099 1.0110 1.0206 1.0057
dispcorr: -0.020036704 hartree
energy: -1111.318317247669
dipole: -12.46932 11.13654 -1.33278 23.06425 -22.92792 0.13633 3.01504 -4.01922 -1.00418
magnitude: 1.67430 au
magnitude: 4.25572 debye
