program: Orca
programVersion: 5.0.2
elementType: F O N N N N N C C C C C C C C C C C C C C C C C H H H H H H H H H H H H H H H H H H H H H H H H
charge: 0
multiplicity: 1
keywords: wb97x-d3
keywords: def2-TZVPP
keywords: def2/J RIJCOSX
keywords: DEFGRID2
keywords: scfconv7
keywords: smallprint printgap noloewdin
keywords: NOSOSCF
formula: C17H24FN5O
InChI: InChI=1/C17H24FN5O/c1-10-6-11(2)8-13(7-10)24-9-12(3)20-16-22-14(17(4,5)18)21-15(19)23-16/h6-8,12,20H,9,19H2,1-5H3
48 atoms
F  3.898546 -2.345124 1.210992
O  -2.033701 1.372889 0.307492
N  -1.600235 -2.122576 -0.632046
N  0.459998 -2.014469 0.374485
N  2.166245 -3.456613 -0.361156
N  0.013825 -3.56451 -1.35535
N  1.69858 -4.952537 -2.022391
C  -2.131098 -0.998188 0.111404
C  -1.60984 0.297217 -0.505504
C  2.60743 -1.864863 1.429869
C  -3.648185 -1.073133 0.11403
C  1.691267 -2.496234 0.398873
C  -0.343705 -2.578785 -0.533977
C  -1.589722 2.617099 0.025237
C  2.642972 -0.355033 1.278247
C  2.184961 -2.291521 2.824763
C  -0.767627 2.925257 -1.050006
C  -2.008771 3.624454 0.898415
C  -0.355475 4.245305 -1.255468
C  -1.607123 4.934773 0.701776
C  -0.776811 5.235288 -0.382109
C  1.273117 -3.968547 -1.22935
C  0.529186 4.567607 -2.423854
C  -2.035477 6.020665 1.643855
H  -1.765629 -1.062526 1.138681
H  -0.517197 0.263405 -0.554222
H  -1.992188 0.403931 -1.528329
H  -2.168356 -2.52528 -1.361503
H  -4.079063 -0.253114 0.685905
H  -3.990115 -2.004161 0.566301
H  -4.050991 -1.019379 -0.900247
H  3.348284 0.076287 1.988035
H  1.664401 0.074905 1.475765
H  2.943417 -0.05872 0.272676
H  1.172807 -1.953713 3.038275
H  2.849381 -1.859137 3.573983
H  2.208239 -3.376684 2.930781
H  -2.651724 3.366795 1.732645
H  -0.45747 6.259707 -0.540696
H  1.424506 3.943462 -2.430449
H  0.014845 4.393727 -3.371204
H  0.850331 5.608621 -2.410338
H  -1.193736 6.376967 2.241505
H  -2.806103 5.678735 2.333946
H  2.643831 -5.286791 -1.951247
H  1.07511 -5.377681 -2.686541
H  -0.434111 2.162606 -1.742667
H  -2.428041 6.884013 1.104503
elementType: F O N C H
totalener: -1111.29811011 hartree
nucrepener: 2066.11259021 hartree
electener: -3177.41070033 hartree
oneelecener: -5619.14261847 hartree
twoeener: 2441.73191814 hartree
cpcmener: -0.03226590 hartree
kineticenergy: 1106.44562489 hartree
xcener: -106.879126206968 hartree
chargesum: 0.0000000
charge: -0.262214 -0.330514 -0.214690 -0.474753 -0.391411 -0.437131 -0.248546 0.157945 -0.021443 0.342272 -0.277629 0.210124 0.389551 0.342712 -0.306724 -0.314511 -0.237156 -0.306097 -0.025491 0.043295 -0.247163 0.354208 -0.218050 -0.213299 0.065323 0.105129 0.110105 0.161879 0.092320 0.105195 0.089259 0.106521 0.092816 0.109322 0.097712 0.103754 0.109296 0.123443 0.122240 0.101589 0.103171 0.089996 0.103853 0.091271 0.192133 0.189647 0.120800 0.099942
qa: -0.2622 -0.3305 -0.2147 -0.4748 -0.3914 -0.4371 -0.2485 0.1579 -0.0214 0.3423 -0.2776 0.2101 0.3896 0.3427 -0.3067 -0.3145 -0.2372 -0.3061 -0.0255 0.0433 -0.2472 0.3542 -0.2181 -0.2133 0.0653 0.1051 0.1101 0.1619 0.0923 0.1052 0.0893 0.1065 0.0928 0.1093 0.0977 0.1038 0.1093 0.1234 0.1222 0.1016 0.1032 0.0900 0.1039 0.0913 0.1921 0.1896 0.1208 0.0999
va: 1.0098 2.0676 3.1981 2.9331 3.0201 2.9865 3.2037 3.8262 3.8049 3.9178 3.9183 4.0555 4.2330 3.7768 3.9325 3.9294 3.8449 4.0256 3.8331 3.7419 3.9323 4.3316 3.9021 3.8976 1.0361 0.9985 0.9985 1.0308 1.0159 1.0066 1.0030 1.0080 1.0104 1.0060 1.0119 1.0050 1.0086 1.0201 1.0111 0.9958 0.9942 1.0055 0.9936 1.0057 1.0100 1.0110 1.0202 0.9968
dispcorr: -0.020667252 hartree
energy: -1111.318777365343
dipole: -11.45591 10.28017 -1.17574 21.60877 -21.79228 -0.18351 2.23285 -3.19819 -0.96534
magnitude: 1.53230 au
magnitude: 3.89479 debye
