program: Orca
programVersion: 5.0.2
elementType: F O N N N N N C C C C C C C C C C C C C C C C C H H H H H H H H H H H H H H H H H H H H H H H H
charge: 0
multiplicity: 1
keywords: wb97x-d3
keywords: def2-TZVPP
keywords: def2/J RIJCOSX
keywords: DEFGRID2
keywords: scfconv7
keywords: smallprint printgap noloewdin
keywords: NOSOSCF
formula: C17H24FN5O
InChI: InChI=1/C17H24FN5O/c1-10-6-11(2)8-13(7-10)24-9-12(3)20-16-22-14(17(4,5)18)21-15(19)23-16/h6-8,12,20H,9,19H2,1-5H3
48 atoms
F  2.071531 -2.124645 2.501797
O  -1.194321 0.777282 0.457157
N  -1.957202 -1.853644 -0.003816
N  0.259532 -1.948861 0.628482
N  1.864771 -2.522068 -0.993356
N  -0.43155 -2.48441 -1.570848
N  1.161453 -3.06078 -3.100878
C  -2.402001 -1.136282 1.172456
C  -2.466593 0.363158 0.905237
C  2.60549 -1.920955 1.225165
C  -3.765403 -1.64437 1.610338
C  1.492301 -2.169214 0.221771
C  -0.675563 -2.09607 -0.320659
C  -0.995718 2.053515 0.072377
C  3.771456 -2.87291 1.058574
C  3.035899 -0.466461 1.13342
C  -1.943099 3.061173 0.177875
C  0.26765 2.330484 -0.458648
C  -1.628131 4.357279 -0.242241
C  0.589417 3.60992 -0.873959
C  -0.37039 4.620719 -0.761226
C  0.850009 -2.684949 -1.858804
C  -2.657462 5.442148 -0.121407
C  1.947551 3.916252 -1.431903
H  -1.679507 -1.320355 1.967427
H  -3.232635 0.577519 0.149262
H  -2.748434 0.885818 1.826505
H  -2.609902 -1.917471 -0.772254
H  -4.113215 -1.103403 2.490738
H  -3.720368 -2.702708 1.865849
H  -4.512712 -1.517057 0.82421
H  4.510999 -2.694571 1.840198
H  4.258883 -2.724481 0.097666
H  3.45419 -3.914941 1.116817
H  2.197649 0.204325 1.326369
H  3.42842 -0.243872 0.141206
H  3.821828 -0.253336 1.859737
H  0.992214 1.527756 -0.542266
H  -0.125833 5.626452 -1.085195
H  -2.975596 5.574911 0.914358
H  -2.274805 6.398761 -0.475351
H  -3.552788 5.20791 -0.700295
H  2.49555 4.601516 -0.782223
H  1.878222 4.394242 -2.410425
H  2.117216 -3.246941 -3.350131
H  0.439164 -3.222416 -3.781283
H  -2.927004 2.866745 0.587127
H  2.549861 3.015256 -1.543678
elementType: F O N C H
totalener: -1111.29629877 hartree
nucrepener: 2134.63313548 hartree
electener: -3245.92943425 hartree
oneelecener: -5757.25259550 hartree
twoeener: 2511.32316125 hartree
cpcmener: -0.03566265 hartree
kineticenergy: 1106.44670585 hartree
xcener: -106.878157850748 hartree
chargesum: 0.0000000
charge: -0.268144 -0.308713 -0.199413 -0.405742 -0.443228 -0.430943 -0.256068 0.161978 -0.022416 0.345797 -0.291507 0.210114 0.369364 0.342789 -0.280242 -0.335128 -0.260900 -0.298442 -0.010035 0.041452 -0.252800 0.348032 -0.217424 -0.220053 0.079715 0.100447 0.104416 0.154375 0.093224 0.100404 0.093163 0.103277 0.086610 0.106363 0.100932 0.103855 0.110019 0.134428 0.121561 0.102249 0.089091 0.102254 0.102871 0.100576 0.189994 0.189526 0.121326 0.090999
qa: -0.2681 -0.3087 -0.1994 -0.4057 -0.4432 -0.4309 -0.2561 0.1620 -0.0224 0.3458 -0.2915 0.2101 0.3694 0.3428 -0.2802 -0.3351 -0.2609 -0.2984 -0.0100 0.0415 -0.2528 0.3480 -0.2174 -0.2201 0.0797 0.1004 0.1044 0.1544 0.0932 0.1004 0.0932 0.1033 0.0866 0.1064 0.1009 0.1039 0.1100 0.1344 0.1216 0.1022 0.0891 0.1023 0.1029 0.1006 0.1900 0.1895 0.1213 0.0910
va: 1.0023 2.0890 3.1760 2.9959 2.9629 2.9703 3.2049 3.8239 3.8979 3.8837 3.9609 4.0855 4.2707 3.8095 3.9188 3.9222 3.9049 3.9754 3.8274 3.7539 3.9423 4.3420 3.9021 3.9017 1.0413 0.9940 0.9937 1.0321 1.0046 1.0073 1.0024 1.0067 1.0209 1.0095 1.0162 1.0086 1.0084 1.0063 1.0113 0.9949 1.0059 0.9947 0.9940 0.9960 1.0113 1.0113 1.0188 1.0061
dispcorr: -0.022025122 hartree
energy: -1111.318323896199
dipole: -4.26615 3.26214 -1.00401 16.99045 -16.55999 0.43046 -1.12671 -0.24805 -1.37475
magnitude: 1.75593 au
magnitude: 4.46321 debye
