program: Orca
programVersion: 5.0.2
elementType: F O N N N N N C C C C C C C C C C C C C C C C C H H H H H H H H H H H H H H H H H H H H H H H H
charge: 0
multiplicity: 1
keywords: wb97x-d3
keywords: def2-TZVPP
keywords: def2/J RIJCOSX
keywords: DEFGRID2
keywords: scfconv7
keywords: smallprint printgap noloewdin
keywords: NOSOSCF
formula: C17H24FN5O
InChI: InChI=1/C17H24FN5O/c1-10-6-11(2)8-13(7-10)24-9-12(3)20-16-22-14(17(4,5)18)21-15(19)23-16/h6-8,12,20H,9,19H2,1-5H3
48 atoms
F  3.809416 -2.625873 0.740456
O  -1.168931 0.882193 0.520311
N  -1.880922 -1.751983 -0.067733
N  0.32124 -1.957935 0.583918
N  1.897694 -2.72148 -0.988933
N  -0.382415 -2.504238 -1.606156
N  1.182361 -3.251355 -3.091835
C  -2.328144 -1.09575 1.141589
C  -2.431846 0.409877 0.938897
C  2.616193 -2.117398 1.256812
C  -3.675296 -1.65412 1.572543
C  1.540543 -2.292517 0.201107
C  -0.614705 -2.072781 -0.366135
C  -1.031843 2.163943 0.125866
C  2.824952 -0.639075 1.535559
C  2.289815 -2.900341 2.514869
C  -2.026504 3.12547 0.231837
C  0.212364 2.499552 -0.416201
C  -1.782354 4.431176 -0.204972
C  0.464384 3.789467 -0.848686
C  -0.544758 4.751549 -0.73989
C  0.881683 -2.814415 -1.867502
C  -2.865057 5.462968 -0.08648
C  1.800264 4.159885 -1.42138
H  -1.592596 -1.296833 1.92057
H  -3.19824 0.63276 0.186125
H  -2.735954 0.885451 1.878322
H  -2.539773 -1.813396 -0.830599
H  -3.60383 -2.722575 1.774714
H  -4.43575 -1.505042 0.80272
H  -4.023014 -1.164643 2.482946
H  3.611197 -0.498444 2.279356
H  1.911133 -0.188454 1.920338
H  3.11041 -0.10105 0.62971
H  2.147838 -3.960806 2.301181
H  1.379497 -2.524867 2.978089
H  3.100335 -2.801737 3.238858
H  0.978264 1.735703 -0.495473
H  -0.354737 5.763963 -1.07928
H  -2.537029 6.433339 -0.457674
H  -3.753526 5.174781 -0.651508
H  -3.178098 5.593632 0.951135
H  1.696191 4.648715 -2.391325
H  2.438234 3.286767 -1.554556
H  2.136253 -3.452865 -3.337007
H  0.476285 -3.300742 -3.8057
H  -2.995407 2.887268 0.653466
H  2.328733 4.858358 -0.769276
elementType: F O N C H
totalener: -1111.29775964 hartree
nucrepener: 2116.18436274 hartree
electener: -3227.48212238 hartree
oneelecener: -5720.03777645 hartree
twoeener: 2492.55565407 hartree
cpcmener: -0.03590330 hartree
kineticenergy: 1106.44159993 hartree
xcener: -106.878017872647 hartree
chargesum: 0.0000000
charge: -0.263306 -0.316015 -0.197111 -0.460664 -0.392776 -0.435134 -0.250264 0.145604 -0.016923 0.345253 -0.289978 0.212032 0.372417 0.341465 -0.320538 -0.304500 -0.257813 -0.297687 -0.011745 0.044932 -0.253268 0.353455 -0.217648 -0.216249 0.081961 0.100647 0.104193 0.154979 0.100889 0.094125 0.093098 0.107197 0.093113 0.108736 0.108459 0.094086 0.102965 0.130343 0.122107 0.089174 0.102575 0.102300 0.100085 0.091455 0.190838 0.188882 0.121366 0.102887
qa: -0.2633 -0.3160 -0.1971 -0.4607 -0.3928 -0.4351 -0.2503 0.1456 -0.0169 0.3453 -0.2900 0.2120 0.3724 0.3415 -0.3205 -0.3045 -0.2578 -0.2977 -0.0117 0.0449 -0.2533 0.3535 -0.2176 -0.2162 0.0820 0.1006 0.1042 0.1550 0.1009 0.0941 0.0931 0.1072 0.0931 0.1087 0.1085 0.0941 0.1030 0.1303 0.1221 0.0892 0.1026 0.1023 0.1001 0.0915 0.1908 0.1889 0.1214 0.1029
va: 1.0080 2.0804 3.1852 2.9321 3.0156 2.9753 3.1992 3.8399 3.8936 3.9082 3.9612 4.0502 4.2676 3.7960 3.9278 3.9349 3.9001 3.9854 3.8272 3.7403 3.9400 4.3327 3.9020 3.8988 1.0344 0.9944 0.9939 1.0324 1.0068 1.0021 1.0049 1.0073 1.0161 1.0089 1.0061 1.0129 1.0062 1.0096 1.0114 1.0060 0.9946 0.9949 0.9962 1.0059 1.0106 1.0115 1.0185 0.9939
dispcorr: -0.021583803 hartree
energy: -1111.319343446028
dipole: -12.82533 10.58718 -2.23815 18.38552 -17.74970 0.63582 7.28693 -7.41470 -0.12777
magnitude: 2.33022 au
magnitude: 5.92294 debye
