program: Orca
programVersion: 5.0.2
elementType: F O N N N N N C C C C C C C C C C C C C C C C C H H H H H H H H H H H H H H H H H H H H H H H H
charge: 0
multiplicity: 1
keywords: wb97x-d3
keywords: def2-TZVPP
keywords: def2/J RIJCOSX
keywords: DEFGRID2
keywords: scfconv7
keywords: smallprint printgap noloewdin
keywords: NOSOSCF
formula: C17H24FN5O
InChI: InChI=1/C17H24FN5O/c1-10-6-11(2)8-13(7-10)24-9-12(3)20-16-22-14(17(4,5)18)21-15(19)23-16/h6-8,12,20H,9,19H2,1-5H3
48 atoms
F  3.229001 -4.418265 1.616228
O  -1.872472 1.464524 0.02712
N  -1.206314 -1.291982 0.03166
N  0.788617 -2.129983 0.818763
N  2.087173 -3.470794 -0.612576
N  0.042182 -2.559688 -1.386147
N  1.359796 -3.829572 -2.74971
C  -1.522144 -0.546046 1.232463
C  -1.120564 0.914934 1.091139
C  2.882224 -3.058399 1.626965
C  -2.995441 -0.719283 1.573389
C  1.836237 -2.879068 0.537669
C  -0.09642 -2.006782 -0.18311
C  -1.683933 2.749187 -0.338318
C  4.12668 -2.26383 1.275403
C  2.370618 -2.730057 3.012651
C  -2.485325 3.203619 -1.384598
C  -0.76058 3.603597 0.255105
C  -2.368424 4.506196 -1.846857
C  -0.633917 4.91505 -0.203516
C  -1.435585 5.354092 -1.25034
C  1.151018 -3.27221 -1.555396
C  -3.24286 4.986657 -2.967844
C  0.348326 5.841391 0.451567
H  -0.921429 -0.952767 2.046007
H  -1.321153 1.445715 2.029033
H  -0.046004 0.985699 0.889366
H  -1.830685 -1.199195 -0.755652
H  -3.219487 -1.765424 1.780978
H  -3.647127 -0.392658 0.761839
H  -3.253481 -0.140652 2.460855
H  4.898095 -2.40481 2.034057
H  3.899197 -1.19858 1.22634
H  4.529717 -2.567121 0.309016
H  1.472279 -3.295536 3.260713
H  2.134128 -1.67162 3.101147
H  3.138558 -2.96229 3.751669
H  -0.13089 3.270518 1.070877
H  -1.333821 6.371935 -1.609887
H  -3.171259 4.333958 -3.839189
H  -4.29312 5.005059 -2.670295
H  -2.973749 5.993888 -3.284176
H  -0.024256 6.189708 1.417513
H  0.538698 6.722402 -0.160664
H  2.166002 -4.409482 -2.905045
H  0.674417 -3.74178 -3.479916
H  -3.200623 2.524635 -1.836082
H  1.303871 5.349678 0.637737
elementType: F O N C H
totalener: -1111.29759156 hartree
nucrepener: 2038.82841623 hartree
electener: -3150.12600780 hartree
oneelecener: -5564.60982608 hartree
twoeener: 2414.48381829 hartree
cpcmener: -0.03179276 hartree
kineticenergy: 1106.44273419 hartree
xcener: -106.877345644949 hartree
chargesum: 0.0000000
charge: -0.270958 -0.331819 -0.207642 -0.440283 -0.417310 -0.438731 -0.252271 0.130354 -0.007016 0.304529 -0.285189 0.216315 0.400583 0.333077 -0.302364 -0.280828 -0.308751 -0.232943 0.041937 -0.020435 -0.244042 0.349539 -0.209918 -0.217775 0.085308 0.114097 0.107311 0.160575 0.101558 0.093807 0.089088 0.103470 0.101796 0.102949 0.103685 0.086308 0.106404 0.121659 0.123062 0.100959 0.102324 0.090400 0.103885 0.092024 0.190771 0.189313 0.122360 0.098826
qa: -0.2710 -0.3318 -0.2076 -0.4403 -0.4173 -0.4387 -0.2523 0.1304 -0.0070 0.3045 -0.2852 0.2163 0.4006 0.3331 -0.3024 -0.2808 -0.3088 -0.2329 0.0419 -0.0204 -0.2440 0.3495 -0.2099 -0.2178 0.0853 0.1141 0.1073 0.1606 0.1016 0.0938 0.0891 0.1035 0.1018 0.1029 0.1037 0.0863 0.1064 0.1217 0.1231 0.1010 0.1023 0.0904 0.1039 0.0920 0.1908 0.1893 0.1224 0.0988
va: 0.9960 2.0704 3.2150 2.9698 3.0114 2.9749 3.2023 3.8867 3.8622 3.8987 3.9546 4.0963 4.2155 3.7894 3.9199 3.9270 4.0288 3.8612 3.7377 3.8179 3.9411 4.3368 3.8953 3.8997 1.0303 0.9939 0.9968 1.0345 1.0066 1.0082 1.0061 1.0056 1.0058 1.0198 1.0124 1.0125 1.0070 1.0203 1.0114 0.9966 0.9949 1.0062 0.9932 1.0044 1.0108 1.0113 1.0193 0.9983
dispcorr: -0.020119448 hartree
energy: -1111.317711012975
dipole: -7.46817 6.89268 -0.57549 24.30162 -23.07569 1.22593 4.41280 -4.58243 -0.16963
magnitude: 1.36487 au
magnitude: 3.46922 debye
