program: Orca
programVersion: 5.0.2
elementType: F O N N N N N C C C C C C C C C C C C C C C C C H H H H H H H H H H H H H H H H H H H H H H H H
charge: 0
multiplicity: 1
keywords: wb97x-d3
keywords: def2-TZVPP
keywords: def2/J RIJCOSX
keywords: DEFGRID2
keywords: scfconv7
keywords: smallprint printgap noloewdin
keywords: NOSOSCF
formula: C17H24FN5O
InChI: InChI=1/C17H24FN5O/c1-10-6-11(2)8-13(7-10)24-9-12(3)20-16-22-14(17(4,5)18)21-15(19)23-16/h6-8,12,20H,9,19H2,1-5H3
48 atoms
F  1.978587 -5.326883 1.949186
O  -1.626178 1.7413 -0.357797
N  -0.075472 -0.634942 -0.281382
N  1.060687 -2.245713 0.912258
N  2.394639 -3.782032 -0.266375
N  1.219746 -2.098856 -1.445873
N  2.540899 -3.606333 -2.539494
C  -0.803521 -0.129679 0.865601
C  -0.887781 1.383548 0.795835
C  2.290259 -3.966529 2.129742
C  -2.16899 -0.791986 1.007409
C  1.877647 -3.27761 0.835944
C  0.753852 -1.68543 -0.269615
C  -1.811316 3.049511 -0.639776
C  3.791773 -3.861418 2.319932
C  1.534813 -3.482507 3.346914
C  -1.337398 4.089183 0.147162
C  -2.532409 3.325273 -1.80496
C  -1.582718 5.413982 -0.226781
C  -2.783316 4.633409 -2.181637
C  -2.301881 5.674638 -1.382026
C  2.034298 -3.147695 -1.393544
C  -1.059042 6.529533 0.629115
C  -3.560587 4.940896 -3.427364
H  -0.212608 -0.352554 1.754468
H  -1.378108 1.755894 1.70196
H  0.120548 1.809992 0.75669
H  -0.349968 -0.306315 -1.195561
H  -2.0568 -1.866675 1.153029
H  -2.791252 -0.636431 0.125701
H  -2.702096 -0.395108 1.872772
H  4.093725 -2.817621 2.412904
H  4.329418 -4.293446 1.476437
H  4.098349 -4.378297 3.230539
H  1.834973 -4.062858 4.220414
H  0.455838 -3.575639 3.225528
H  1.760056 -2.437012 3.551676
H  -2.894733 2.502039 -2.410257
H  -2.493107 6.701932 -1.672716
H  -1.46278 6.478138 1.642012
H  0.02794 6.484615 0.718093
H  -1.317056 7.505251 0.218823
H  -3.837514 4.034977 -3.965339
H  -2.984843 5.569677 -4.108687
H  3.134629 -4.417398 -2.541351
H  2.282275 -3.187664 -3.416059
H  -0.77643 3.899424 1.053682
H  -4.47937 5.483449 -3.196522
elementType: F O N C H
totalener: -1111.29755908 hartree
nucrepener: 2008.54789681 hartree
electener: -3119.84545589 hartree
oneelecener: -5503.96220131 hartree
twoeener: 2384.11674542 hartree
cpcmener: -0.03101903 hartree
kineticenergy: 1106.43269548 hartree
xcener: -106.874911968944 hartree
chargesum: 0.0000000
charge: -0.273772 -0.336102 -0.203977 -0.429343 -0.417946 -0.437623 -0.253233 0.109094 0.022746 0.318839 -0.294320 0.206594 0.397771 0.343589 -0.295837 -0.290735 -0.241236 -0.302460 -0.017274 0.041985 -0.250779 0.350078 -0.215890 -0.211587 0.078957 0.108137 0.112313 0.158657 0.098143 0.092817 0.092205 0.101539 0.101108 0.102008 0.105940 0.100491 0.089652 0.125490 0.122499 0.102414 0.102295 0.089689 0.091358 0.101420 0.191061 0.189434 0.121329 0.102458
qa: -0.2738 -0.3361 -0.2040 -0.4293 -0.4179 -0.4376 -0.2532 0.1091 0.0227 0.3188 -0.2943 0.2066 0.3978 0.3436 -0.2958 -0.2907 -0.2412 -0.3025 -0.0173 0.0420 -0.2508 0.3501 -0.2159 -0.2116 0.0790 0.1081 0.1123 0.1587 0.0981 0.0928 0.0922 0.1015 0.1011 0.1020 0.1059 0.1005 0.0897 0.1255 0.1225 0.1024 0.1023 0.0897 0.0914 0.1014 0.1911 0.1894 0.1213 0.1025
va: 0.9922 2.0652 3.2220 2.9857 3.0037 2.9741 3.2032 3.8877 3.8428 3.8676 3.9604 4.1173 4.2129 3.7712 3.9164 3.9384 3.8727 4.0213 3.8291 3.7420 3.9363 4.3346 3.9020 3.8973 1.0323 0.9925 0.9997 1.0421 1.0070 1.0117 1.0067 1.0039 1.0238 1.0060 1.0067 1.0129 1.0100 1.0183 1.0114 0.9949 0.9949 1.0059 1.0061 0.9955 1.0105 1.0114 1.0195 0.9948
dispcorr: -0.019979937 hartree
energy: -1111.317539013218
dipole: -9.03009 9.12829 0.09820 23.33872 -21.74059 1.59814 4.60973 -4.78264 -0.17291
magnitude: 1.61046 au
magnitude: 4.09346 debye
