program: Orca
programVersion: 5.0.2
elementType: F O N N N N N C C C C C C C C C C C C C C C C C H H H H H H H H H H H H H H H H H H H H H H H H
charge: 0
multiplicity: 1
keywords: wb97x-d3
keywords: def2-TZVPP
keywords: def2/J RIJCOSX
keywords: DEFGRID2
keywords: scfconv7
keywords: smallprint printgap noloewdin
keywords: NOSOSCF
formula: C17H24FN5O
InChI: InChI=1/C17H24FN5O/c1-10-6-11(2)8-13(7-10)24-9-12(3)20-16-22-14(17(4,5)18)21-15(19)23-16/h6-8,12,20H,9,19H2,1-5H3
48 atoms
F  2.071004 -5.319021 1.922497
O  -1.636225 1.723088 -0.344599
N  -0.101382 -0.650921 -0.287513
N  1.049442 -2.248179 0.904081
N  2.419393 -3.757721 -0.267232
N  1.218614 -2.09556 -1.452398
N  2.565659 -3.583471 -2.540704
C  -0.829891 -0.157923 0.864789
C  -0.908525 1.356038 0.812248
C  2.29181 -3.946804 2.129969
C  -2.197652 -0.818035 0.993757
C  1.883933 -3.265216 0.831864
C  0.741633 -1.689977 -0.278021
C  -1.805714 3.031799 -0.6313
C  3.776168 -3.751717 2.372747
C  1.463824 -3.52757 3.323773
C  -1.327625 4.070196 0.1546
C  -2.51593 3.308147 -1.802681
C  -1.557942 5.395412 -0.228181
C  -2.751025 4.616161 -2.188631
C  -2.265117 5.656717 -1.390829
C  2.05126 -3.130474 -1.395947
C  -1.034392 6.51157 0.627034
C  -3.516098 4.922297 -3.44198
H  -0.241599 -0.395648 1.751361
H  -1.405195 1.722157 1.717582
H  0.101578 1.779201 0.78516
H  -0.380108 -0.319675 -1.199418
H  -2.81851 -0.645531 0.114136
H  -2.730585 -0.434827 1.865355
H  -2.088922 -1.895587 1.120695
H  4.366945 -4.128689 1.538557
H  4.086103 -4.270292 3.281233
H  4.007793 -2.693929 2.498207
H  0.398421 -3.684494 3.157942
H  1.61565 -2.474297 3.551659
H  1.765166 -4.102901 4.200228
H  -2.881554 2.484497 -2.405398
H  -2.44424 6.684292 -1.688064
H  -1.279226 7.486719 0.207348
H  -1.451339 6.470284 1.635034
H  0.050968 6.458454 0.730185
H  -3.804261 4.014515 -3.970872
H  -2.926492 5.533568 -4.127422
H  3.185805 -4.374431 -2.539279
H  2.312321 -3.160369 -3.41664
H  -0.776156 3.878944 1.066778
H  -4.427331 5.481885 -3.2226
elementType: F O N C H
totalener: -1111.29766220 hartree
nucrepener: 2010.37392193 hartree
electener: -3121.67158414 hartree
oneelecener: -5507.61365716 hartree
twoeener: 2385.94207303 hartree
cpcmener: -0.03105047 hartree
kineticenergy: 1106.44763251 hartree
xcener: -106.877882007802 hartree
chargesum: -0.0000000
charge: -0.272755 -0.335587 -0.203279 -0.431115 -0.418954 -0.437671 -0.252973 0.108675 0.022045 0.312778 -0.294393 0.211397 0.397705 0.342812 -0.296977 -0.288242 -0.242263 -0.301668 -0.015811 0.041877 -0.251915 0.349838 -0.215631 -0.211409 0.079560 0.108336 0.111667 0.158635 0.092948 0.092153 0.098267 0.101872 0.102497 0.101306 0.101792 0.088774 0.105945 0.125384 0.122617 0.089730 0.102426 0.102204 0.091382 0.101493 0.191137 0.189374 0.121792 0.102225
qa: -0.2728 -0.3356 -0.2033 -0.4311 -0.4190 -0.4377 -0.2530 0.1087 0.0220 0.3128 -0.2944 0.2114 0.3977 0.3428 -0.2970 -0.2882 -0.2423 -0.3017 -0.0158 0.0419 -0.2519 0.3498 -0.2156 -0.2114 0.0796 0.1083 0.1117 0.1586 0.0929 0.0922 0.0983 0.1019 0.1025 0.1013 0.1018 0.0888 0.1059 0.1254 0.1226 0.0897 0.1024 0.1022 0.0914 0.1015 0.1911 0.1894 0.1218 0.1022
va: 0.9933 2.0646 3.2237 2.9831 3.0056 2.9739 3.2024 3.8874 3.8457 3.8778 3.9608 4.1086 4.2144 3.7718 3.9176 3.9357 3.8757 4.0202 3.8276 3.7423 3.9367 4.3356 3.9019 3.8973 1.0330 0.9927 0.9996 1.0421 1.0116 1.0067 1.0068 1.0225 1.0060 1.0044 1.0127 1.0105 1.0068 1.0184 1.0114 1.0059 0.9948 0.9950 1.0061 0.9954 1.0106 1.0115 1.0193 0.9949
dispcorr: -0.020013595 hartree
energy: -1111.317675797886
dipole: -9.40934 9.45937 0.05003 23.32847 -21.72022 1.60825 4.71155 -4.85068 -0.13913
magnitude: 1.61503 au
magnitude: 4.10508 debye
