program: Orca
programVersion: 5.0.2
elementType: F O N N N N N C C C C C C C C C C C C C C C C C H H H H H H H H H H H H H H H H H H H H H H H H
charge: 0
multiplicity: 1
keywords: wb97x-d3
keywords: def2-TZVPP
keywords: def2/J RIJCOSX
keywords: DEFGRID2
keywords: scfconv7
keywords: smallprint printgap noloewdin
keywords: NOSOSCF
formula: C17H24FN5O
InChI: InChI=1/C17H24FN5O/c1-10-6-11(2)8-13(7-10)24-9-12(3)20-16-22-14(17(4,5)18)21-15(19)23-16/h6-8,12,20H,9,19H2,1-5H3
48 atoms
F  2.967737 -4.6275 1.777371
O  -1.853167 1.556686 0.022647
N  -1.046943 -1.168807 0.035071
N  0.880813 -2.138074 0.843908
N  2.093006 -3.572308 -0.571219
N  0.115817 -2.536581 -1.360896
N  1.349249 -3.907793 -2.705831
C  -1.33975 -0.41752 1.237642
C  -1.017074 1.0575 1.04835
C  2.895507 -3.22737 1.672619
C  -2.781767 -0.653425 1.665822
C  1.87788 -2.956087 0.574024
C  0.010962 -1.962415 -0.164355
C  -1.731396 2.841768 -0.371293
C  4.265402 -2.72705 1.255503
C  2.485734 -2.689772 3.025588
C  -2.594028 3.243143 -1.395127
C  -0.827875 3.744161 0.17113
C  -2.555514 4.538956 -1.878748
C  -0.780845 5.055938 -0.311568
C  -1.641049 5.441582 -1.327257
C  1.174843 -3.324013 -1.518524
C  -3.477056 4.976863 -2.978637
C  0.200568 6.025794 0.278763
H  -0.67405 -0.777866 2.021591
H  -1.187145 1.594854 1.988403
H  0.03911 1.173538 0.781588
H  -1.673781 -1.064823 -0.748359
H  -3.492626 -0.37221 0.887979
H  -3.017576 -0.073021 2.558152
H  -2.942994 -1.70514 1.900465
H  5.005255 -2.952204 2.025153
H  4.251299 -1.646004 1.113656
H  4.586552 -3.185337 0.320252
H  3.218592 -2.988449 3.776214
H  1.507935 -3.059157 3.333835
H  2.445269 -1.602083 3.016942
H  -0.152058 3.455505 0.966706
H  -1.604852 6.459275 -1.700696
H  -4.108613 5.808173 -2.660078
H  -2.917528 5.320564 -3.850584
H  -4.131654 4.168685 -3.302895
H  0.040196 6.151936 1.35109
H  0.121526 7.008259 -0.185443
H  2.110669 -4.548491 -2.847631
H  0.666908 -3.790574 -3.434928
H  -3.29421 2.525172 -1.807507
H  1.228047 5.680282 0.150409
elementType: F O N C H
totalener: -1111.29758264 hartree
nucrepener: 2029.03716228 hartree
electener: -3140.33474491 hartree
oneelecener: -5545.00868061 hartree
twoeener: 2404.67393569 hartree
cpcmener: -0.03136730 hartree
kineticenergy: 1106.44570038 hartree
xcener: -106.877705396999 hartree
chargesum: 0.0000000
charge: -0.273018 -0.331945 -0.204722 -0.429545 -0.418802 -0.438884 -0.253083 0.119020 -0.001063 0.313356 -0.282520 0.208573 0.399738 0.335582 -0.294775 -0.288511 -0.297029 -0.243450 0.040589 -0.015930 -0.250891 0.349460 -0.211826 -0.216797 0.085800 0.111264 0.109191 0.159951 0.093706 0.089151 0.100563 0.102050 0.101039 0.100829 0.105897 0.100565 0.089316 0.121497 0.122625 0.102003 0.101960 0.091248 0.102094 0.089263 0.190809 0.189209 0.123384 0.103062
qa: -0.2730 -0.3319 -0.2047 -0.4295 -0.4188 -0.4389 -0.2531 0.1190 -0.0011 0.3134 -0.2825 0.2086 0.3997 0.3356 -0.2948 -0.2885 -0.2970 -0.2435 0.0406 -0.0159 -0.2509 0.3495 -0.2118 -0.2168 0.0858 0.1113 0.1092 0.1600 0.0937 0.0892 0.1006 0.1021 0.1010 0.1008 0.1059 0.1006 0.0893 0.1215 0.1226 0.1020 0.1020 0.0912 0.1021 0.0893 0.1908 0.1892 0.1234 0.1031
va: 0.9929 2.0718 3.2177 2.9820 3.0045 2.9736 3.2029 3.8895 3.8738 3.8748 3.9583 4.1130 4.2168 3.7890 3.9167 3.9328 4.0146 3.8647 3.7440 3.8227 3.9358 4.3355 3.8969 3.9008 1.0337 0.9936 0.9964 1.0359 1.0084 1.0062 1.0066 1.0058 1.0045 1.0232 1.0069 1.0131 1.0107 1.0198 1.0112 0.9950 0.9952 1.0061 0.9951 1.0059 1.0107 1.0114 1.0195 0.9946
dispcorr: -0.019983629 hartree
energy: -1111.317566264848
dipole: -6.49784 6.14196 -0.35588 24.48725 -23.18147 1.30578 3.70282 -3.99307 -0.29025
magnitude: 1.38418 au
magnitude: 3.51831 debye
