program: Orca
programVersion: 5.0.2
elementType: F O N N N N N C C C C C C C C C C C C C C C C C H H H H H H H H H H H H H H H H H H H H H H H H
charge: 0
multiplicity: 1
keywords: wb97x-d3
keywords: def2-TZVPP
keywords: def2/J RIJCOSX
keywords: DEFGRID2
keywords: scfconv7
keywords: smallprint printgap noloewdin
keywords: NOSOSCF
formula: C17H24FN5O
InChI: InChI=1/C17H24FN5O/c1-10-6-11(2)8-13(7-10)24-9-12(3)20-16-22-14(17(4,5)18)21-15(19)23-16/h6-8,12,20H,9,19H2,1-5H3
48 atoms
F  4.190666 -2.70338 1.109025
O  -1.91346 1.407162 0.031053
N  -1.075219 -1.299388 -0.078774
N  0.881144 -2.197924 0.7400
N  2.279644 -3.378524 -0.736491
N  0.254356 -2.441912 -1.529355
N  1.645178 -3.597292 -2.922263
C  -1.444296 -0.630365 1.151897
C  -1.135986 0.857774 1.076842
C  2.948444 -3.175934 1.57115
C  -2.903636 -0.910427 1.481853
C  1.961469 -2.892637 0.447382
C  0.047277 -1.994596 -0.292991
C  -1.817457 2.721587 -0.256036
C  2.630487 -2.44441 2.855845
C  3.073391 -4.670992 1.790503
C  -2.627253 3.171278 -1.302746
C  -0.986224 3.609749 0.411669
C  -2.607637 4.501136 -1.684872
C  -0.959082 4.955547 0.032819
C  -1.765558 5.388271 -1.007897
C  1.382381 -3.122985 -1.702483
C  -3.481312 4.994067 -2.800303
C  -0.065122 5.912413 0.765112
H  -0.819129 -1.033505 1.948265
H  -1.377426 1.331165 2.0356
H  -0.067136 1.006887 0.887564
H  -1.659672 -1.147111 -0.88791
H  -3.19666 -0.385389 2.39211
H  -3.060268 -1.97658 1.646447
H  -3.575079 -0.593119 0.682691
H  2.547155 -1.368504 2.706908
H  3.417128 -2.632272 3.588109
H  1.6927 -2.797614 3.281302
H  3.801582 -4.883192 2.574734
H  3.382611 -5.183021 0.880184
H  2.117005 -5.091156 2.103543
H  -0.350806 3.282107 1.225183
H  -1.742626 6.431515 -1.303462
H  -4.25492 5.667911 -2.426596
H  -2.905333 5.551992 -3.540164
H  -3.980021 4.173658 -3.315214
H  -0.39262 6.048198 1.797931
H  -0.054594 6.893633 0.291751
H  2.514424 -4.067593 -3.105408
H  1.0344 -3.385659 -3.692219
H  -3.270462 2.463654 -1.813614
H  0.963428 5.549904 0.803662
elementType: F O N C H
totalener: -1111.29738217 hartree
nucrepener: 2033.35426101 hartree
electener: -3144.65164317 hartree
oneelecener: -5553.74532111 hartree
twoeener: 2409.09367793 hartree
cpcmener: -0.03128827 hartree
kineticenergy: 1106.44244281 hartree
xcener: -106.876872955344 hartree
chargesum: -0.0000000
charge: -0.273920 -0.332195 -0.207033 -0.427607 -0.420135 -0.437710 -0.253954 0.124757 -0.004219 0.318740 -0.283706 0.206146 0.396847 0.334788 -0.291816 -0.295510 -0.298572 -0.242757 0.040776 -0.015986 -0.250238 0.350413 -0.211352 -0.215673 0.086385 0.111934 0.110130 0.160367 0.089582 0.100239 0.093902 0.100095 0.106263 0.090017 0.102073 0.101047 0.101291 0.121905 0.122369 0.102918 0.100441 0.091184 0.103246 0.089918 0.190733 0.189578 0.123226 0.101073
qa: -0.2739 -0.3322 -0.2070 -0.4276 -0.4201 -0.4377 -0.2540 0.1248 -0.0042 0.3187 -0.2837 0.2061 0.3968 0.3348 -0.2918 -0.2955 -0.2986 -0.2428 0.0408 -0.0160 -0.2502 0.3504 -0.2114 -0.2157 0.0864 0.1119 0.1101 0.1604 0.0896 0.1002 0.0939 0.1001 0.1063 0.0900 0.1021 0.1010 0.1013 0.1219 0.1224 0.1029 0.1004 0.0912 0.1032 0.0899 0.1907 0.1896 0.1232 0.1011
va: 0.9919 2.0711 3.2138 2.9818 3.0054 2.9743 3.2021 3.8879 3.8747 3.8704 3.9569 4.1162 4.2193 3.7914 3.9366 3.9167 4.0175 3.8668 3.7434 3.8212 3.9363 4.3335 3.8970 3.9008 1.0320 0.9937 0.9959 1.0355 1.0060 1.0068 1.0082 1.0133 1.0067 1.0098 1.0059 1.0237 1.0040 1.0199 1.0113 0.9941 0.9964 1.0058 0.9940 1.0056 1.0107 1.0112 1.0196 0.9962
dispcorr: -0.020043627 hartree
energy: -1111.317425795437
dipole: -12.71167 11.57090 -1.14077 15.47757 -15.35973 0.11784 7.33184 -7.22355 0.10829
magnitude: 1.15194 au
magnitude: 2.92800 debye
