program: Orca
programVersion: 5.0.2
elementType: F O N N N N N C C C C C C C C C C C C C C C C C H H H H H H H H H H H H H H H H H H H H H H H H
charge: 0
multiplicity: 1
keywords: wb97x-d3
keywords: def2-TZVPP
keywords: def2/J RIJCOSX
keywords: DEFGRID2
keywords: scfconv7
keywords: smallprint printgap noloewdin
keywords: NOSOSCF
formula: C17H24FN5O
InChI: InChI=1/C17H24FN5O/c1-10-6-11(2)8-13(7-10)24-9-12(3)20-16-22-14(17(4,5)18)21-15(19)23-16/h6-8,12,20H,9,19H2,1-5H3
48 atoms
F  3.795369 -3.427295 1.86737
O  -1.927888 1.270991 -0.378891
N  -1.16669 -1.459148 -0.43666
N  0.653321 -2.150136 0.790746
N  2.478681 -3.115679 -0.337849
N  0.586293 -2.377246 -1.562693
N  2.392513 -3.296376 -2.612511
C  -1.848844 -0.847035 0.685257
C  -1.4942 0.62925 0.804143
C  2.506926 -2.940803 2.090979
C  -3.347386 -1.08199 0.566176
C  1.847096 -2.718292 0.743087
C  0.055589 -2.004691 -0.397825
C  -1.713406 2.592906 -0.541524
C  2.631109 -1.640913 2.864735
C  1.741045 -3.999127 2.867162
C  -1.052998 3.397179 0.375704
C  -2.206976 3.141984 -1.728391
C  -0.880293 4.759008 0.108147
C  -2.043736 4.488792 -2.00031
C  -1.375029 5.291939 -1.071471
C  1.796503 -2.91625 -1.481447
C  -0.161315 5.621029 1.103773
C  -2.574085 5.086948 -3.269619
H  -1.488462 -1.323174 1.59761
H  -1.984478 1.057481 1.686042
H  -0.412124 0.740851 0.93597
H  -1.557929 -1.317713 -1.355656
H  -3.571755 -2.148252 0.590047
H  -3.756884 -0.675125 -0.359504
H  -3.873938 -0.612731 1.397254
H  3.199477 -0.895972 2.306004
H  3.136421 -1.815925 3.815346
H  1.648662 -1.224743 3.077336
H  1.684204 -4.936584 2.311752
H  0.724659 -3.665993 3.069359
H  2.227813 -4.195875 3.823422
H  -2.721014 2.498304 -2.433563
H  -1.242822 6.348586 -1.277941
H  -0.667267 5.619272 2.071062
H  0.855863 5.264848 1.276896
H  -0.096621 6.654904 0.766317
H  -3.289622 5.884716 -3.062237
H  -3.076378 4.343648 -3.887778
H  3.314711 -3.695806 -2.589391
H  1.939886 -3.158689 -3.499619
H  -0.663807 2.992722 1.302008
H  -1.772947 5.527207 -3.866074
elementType: F O N C H
totalener: -1111.29865815 hartree
nucrepener: 2049.18750889 hartree
electener: -3160.48616704 hartree
oneelecener: -5585.35177801 hartree
twoeener: 2424.86561097 hartree
cpcmener: -0.03202542 hartree
kineticenergy: 1106.44150445 hartree
xcener: -106.878372644359 hartree
chargesum: -0.0000000
charge: -0.262468 -0.331704 -0.216795 -0.477643 -0.390233 -0.438537 -0.248988 0.146069 -0.011669 0.338538 -0.287599 0.216418 0.390320 0.335636 -0.305017 -0.313439 -0.245202 -0.299389 -0.015279 0.042771 -0.251609 0.352970 -0.215656 -0.212801 0.083776 0.116102 0.106016 0.160404 0.101279 0.092927 0.089393 0.109061 0.103410 0.093479 0.109930 0.096189 0.103299 0.122459 0.122377 0.102129 0.102465 0.089462 0.101962 0.090953 0.191694 0.189333 0.120876 0.102333
qa: -0.2625 -0.3317 -0.2168 -0.4776 -0.3902 -0.4385 -0.2490 0.1461 -0.0117 0.3385 -0.2876 0.2164 0.3903 0.3356 -0.3050 -0.3134 -0.2452 -0.2994 -0.0153 0.0428 -0.2516 0.3530 -0.2157 -0.2128 0.0838 0.1161 0.1060 0.1604 0.1013 0.0929 0.0894 0.1091 0.1034 0.0935 0.1099 0.0962 0.1033 0.1225 0.1224 0.1021 0.1025 0.0895 0.1020 0.0910 0.1917 0.1893 0.1209 0.1023
va: 1.0091 2.0696 3.2084 2.9348 3.0183 2.9785 3.2016 3.8755 3.8524 3.9161 3.9511 4.0479 4.2374 3.7891 3.9342 3.9321 3.8695 4.0160 3.8205 3.7413 3.9344 4.3338 3.9010 3.8973 1.0304 0.9944 0.9966 1.0343 1.0071 1.0085 1.0059 1.0061 1.0064 1.0134 1.0078 1.0121 1.0053 1.0203 1.0113 0.9950 0.9949 1.0058 0.9950 1.0062 1.0102 1.0111 1.0203 0.9950
dispcorr: -0.020335214 hartree
energy: -1111.318993360511
dipole: -14.34854 13.25037 -1.09817 19.22951 -18.58874 0.64077 5.48895 -5.53046 -0.04151
magnitude: 1.27212 au
magnitude: 3.23347 debye
