program: Orca
programVersion: 5.0.2
elementType: F O N N N N N C C C C C C C C C C C C C C C C C H H H H H H H H H H H H H H H H H H H H H H H H
charge: 0
multiplicity: 1
keywords: wb97x-d3
keywords: def2-TZVPP
keywords: def2/J RIJCOSX
keywords: DEFGRID2
keywords: scfconv7
keywords: smallprint printgap noloewdin
keywords: NOSOSCF
formula: C17H24FN5O
InChI: InChI=1/C17H24FN5O/c1-10-6-11(2)8-13(7-10)24-9-12(3)20-16-22-14(17(4,5)18)21-15(19)23-16/h6-8,12,20H,9,19H2,1-5H3
48 atoms
F  3.770105 -3.627354 1.885803
O  -1.908064 1.330074 -0.385773
N  -1.061664 -1.373545 -0.432393
N  0.708927 -2.170723 0.805483
N  2.506267 -3.189663 -0.321812
N  0.666126 -2.340577 -1.553647
N  2.445377 -3.313695 -2.601034
C  -1.75135 -0.776493 0.692522
C  -1.440523 0.710603 0.796401
C  2.505316 -3.082729 2.109438
C  -3.243745 -1.058712 0.59519
C  1.876418 -2.791233 0.759864
C  0.135028 -1.971996 -0.387392
C  -1.742833 2.657976 -0.557863
C  2.687953 -1.814592 2.922828
C  1.677672 -4.122851 2.846384
C  -1.108505 3.492001 0.351259
C  -2.261532 3.180841 -1.745749
C  -0.990354 4.858012 0.075785
C  -2.151543 4.531406 -2.025905
C  -1.51078 5.364955 -1.104262
C  1.850473 -2.93347 -1.469342
C  -0.307954 5.754199 1.067063
C  -2.708062 5.101049 -3.297114
H  -1.363462 -1.235344 1.602159
H  -1.933448 1.130106 1.680983
H  -0.360774 0.855935 0.913809
H  -1.437639 -1.207607 -1.353539
H  -3.433661 -2.130944 0.633922
H  -3.676208 -0.675967 -0.330031
H  -3.775045 -0.596391 1.427242
H  3.299048 -1.083536 2.391755
H  3.175311 -2.044299 3.871151
H  1.726676 -1.355081 3.142213
H  1.581358 -5.040197 2.263528
H  0.676647 -3.745226 3.046747
H  2.142412 -4.370421 3.801687
H  -2.75289 2.513743 -2.44526
H  -1.420292 6.424685 -1.31718
H  -0.859697 5.797509 2.008221
H  0.695692 5.396688 1.30321
H  -0.217625 6.772751 0.691074
H  -3.442948 5.881683 -3.092571
H  -3.194843 4.337638 -3.903074
H  3.349639 -3.751967 -2.575424
H  2.012681 -3.134565 -3.490647
H  -0.69859 3.107933 1.277305
H  -1.923582 5.555721 -3.904823
elementType: F O N C H
totalener: -1111.29857576 hartree
nucrepener: 2041.49749460 hartree
electener: -3152.79607036 hartree
oneelecener: -5569.95729664 hartree
twoeener: 2417.16122628 hartree
cpcmener: -0.03199250 hartree
kineticenergy: 1106.44279624 hartree
xcener: -106.878608187317 hartree
chargesum: 0.0000000
charge: -0.262316 -0.331788 -0.214322 -0.478041 -0.390159 -0.439478 -0.249206 0.136281 -0.007440 0.336314 -0.285750 0.218131 0.392189 0.335284 -0.304430 -0.312146 -0.244058 -0.299003 -0.015032 0.042531 -0.251846 0.352385 -0.216103 -0.212648 0.084419 0.114119 0.107224 0.160167 0.100535 0.093198 0.089226 0.109149 0.103312 0.093126 0.109838 0.096003 0.103314 0.122886 0.122601 0.102939 0.101447 0.089863 0.101841 0.090974 0.191656 0.189245 0.121174 0.102399
qa: -0.2623 -0.3318 -0.2143 -0.4780 -0.3902 -0.4395 -0.2492 0.1363 -0.0074 0.3363 -0.2858 0.2181 0.3922 0.3353 -0.3044 -0.3121 -0.2441 -0.2990 -0.0150 0.0425 -0.2518 0.3524 -0.2161 -0.2126 0.0844 0.1141 0.1072 0.1602 0.1005 0.0932 0.0892 0.1091 0.1033 0.0931 0.1098 0.0960 0.1033 0.1229 0.1226 0.1029 0.1014 0.0899 0.1018 0.0910 0.1917 0.1892 0.1212 0.1024
va: 1.0087 2.0705 3.2104 2.9376 3.0162 2.9767 3.2014 3.8805 3.8647 3.9160 3.9541 4.0468 4.2357 3.7904 3.9351 3.9318 3.8687 4.0147 3.8199 3.7413 3.9350 4.3349 3.9009 3.8972 1.0330 0.9941 0.9960 1.0351 1.0071 1.0083 1.0061 1.0061 1.0061 1.0136 1.0077 1.0123 1.0053 1.0201 1.0111 0.9942 0.9956 1.0057 0.9952 1.0062 1.0102 1.0112 1.0201 0.9949
dispcorr: -0.020213902 hartree
energy: -1111.318789660392
dipole: -14.65791 13.58460 -1.07331 19.52484 -18.80371 0.72113 5.43017 -5.47002 -0.03985
magnitude: 1.29368 au
magnitude: 3.28827 debye
