program: Orca
programVersion: 5.0.2
elementType: F O N N N N N C C C C C C C C C C C C C C C C C H H H H H H H H H H H H H H H H H H H H H H H H
charge: 0
multiplicity: 1
keywords: wb97x-d3
keywords: def2-TZVPP
keywords: def2/J RIJCOSX
keywords: DEFGRID2
keywords: scfconv7
keywords: smallprint printgap noloewdin
keywords: NOSOSCF
formula: C17H24FN5O
InChI: InChI=1/C17H24FN5O/c1-10-6-11(2)8-13(7-10)24-9-12(3)20-16-22-14(17(4,5)18)21-15(19)23-16/h6-8,12,20H,9,19H2,1-5H3
48 atoms
F  2.072112 -1.711038 2.629155
O  -2.868882 1.171555 -0.670039
N  -1.505295 -1.266997 -0.379587
N  0.542878 -1.71115 0.556913
N  2.190784 -2.736981 -0.774058
N  0.066542 -2.254484 -1.701318
N  1.714684 -3.216844 -2.956348
C  -2.0103 -0.60644 0.807212
C  -3.164449 0.308607 0.408884
C  2.726114 -2.219606 1.506667
C  -2.49412 -1.586575 1.868444
C  1.740352 -2.219041 0.353354
C  -0.268364 -1.755818 -0.512295
C  -2.041469 2.229179 -0.499251
C  3.172189 -3.632238 1.838832
C  3.898961 -1.304345 1.199366
C  -1.684201 2.899981 -1.671532
C  -1.571532 2.676528 0.726719
C  -0.857289 4.008861 -1.62403
C  -0.732885 3.792846 0.785421
C  -0.381784 4.446685 -0.385252
C  1.305999 -2.725644 -1.783695
C  -0.472295 4.734657 -2.879221
C  -0.224121 4.261468 2.116836
H  -1.19813 -0.013858 1.232668
H  -4.004998 -0.296571 0.060496
H  -3.512788 0.860657 1.287055
H  -2.099557 -1.335583 -1.19191
H  -1.68197 -2.234793 2.193192
H  -3.302872 -2.213756 1.489625
H  -2.861444 -1.052842 2.746288
H  3.696987 -4.078469 0.996892
H  2.322542 -4.270532 2.085781
H  3.851355 -3.620785 2.692208
H  4.585247 -1.273077 2.04665
H  3.565561 -0.286953 0.989558
H  4.449151 -1.665357 0.332685
H  -1.839554 2.180781 1.651363
H  0.272048 5.310871 -0.339712
H  -0.92068 4.280145 -3.761901
H  -0.789497 5.778422 -2.845868
H  0.610039 4.736226 -3.019723
H  -1.044407 4.516268 2.790244
H  0.408208 5.142874 2.016586
H  2.624568 -3.636282 -3.037462
H  1.077373 -3.286982 -3.730634
H  -2.064188 2.540472 -2.621085
H  0.364084 3.485848 2.610975
elementType: F O N C H
totalener: -1111.29620055 hartree
nucrepener: 2108.97490895 hartree
electener: -3220.27110950 hartree
oneelecener: -5705.61371306 hartree
twoeener: 2485.34260356 hartree
cpcmener: -0.03339895 hartree
kineticenergy: 1106.44167762 hartree
xcener: -106.879152738755 hartree
chargesum: -0.0000000
charge: -0.264278 -0.337211 -0.180592 -0.418448 -0.461608 -0.441627 -0.259665 0.082343 0.028697 0.333933 -0.298986 0.231542 0.422253 0.308691 -0.304569 -0.310017 -0.280420 -0.243307 0.043913 -0.004535 -0.250167 0.344009 -0.212007 -0.220874 0.071249 0.125775 0.105624 0.153646 0.097194 0.091548 0.097066 0.093252 0.108872 0.102222 0.102654 0.110500 0.095494 0.127021 0.122992 0.090531 0.101617 0.102102 0.102343 0.089623 0.189495 0.189399 0.118836 0.103877
qa: -0.2643 -0.3372 -0.1806 -0.4184 -0.4616 -0.4416 -0.2597 0.0823 0.0287 0.3339 -0.2990 0.2315 0.4223 0.3087 -0.3046 -0.3100 -0.2804 -0.2433 0.0439 -0.0045 -0.2502 0.3440 -0.2120 -0.2209 0.0712 0.1258 0.1056 0.1536 0.0972 0.0915 0.0971 0.0933 0.1089 0.1022 0.1027 0.1105 0.0955 0.1270 0.1230 0.0905 0.1016 0.1021 0.1023 0.0896 0.1895 0.1894 0.1188 0.1039
va: 1.0050 2.0588 3.1789 2.9782 2.9516 2.9808 3.2040 3.7948 3.8461 3.9020 3.9487 4.0368 4.1696 3.7864 3.9329 3.9332 4.0276 3.8320 3.7482 3.7787 3.9345 4.3460 3.8959 3.9031 1.0372 0.9960 1.0003 1.0395 1.0154 1.0079 1.0065 1.0184 1.0056 1.0057 1.0054 1.0062 1.0158 1.0113 1.0114 1.0063 0.9952 0.9951 0.9951 1.0057 1.0117 1.0114 1.0235 0.9945
dispcorr: -0.021118928 hartree
energy: -1111.317319479074
dipole: 0.31517 -0.40086 -0.08570 10.57813 -11.04474 -0.46661 3.82155 -4.55494 -0.73339
magnitude: 0.87346 au
magnitude: 2.22016 debye
