program: Orca
programVersion: 5.0.2
elementType: F O N N N N N C C C C C C C C C C C C C C C C C H H H H H H H H H H H H H H H H H H H H H H H H
charge: 0
multiplicity: 1
keywords: wb97x-d3
keywords: def2-TZVPP
keywords: def2/J RIJCOSX
keywords: DEFGRID2
keywords: scfconv7
keywords: smallprint printgap noloewdin
keywords: NOSOSCF
formula: C17H24FN5O
InChI: InChI=1/C17H24FN5O/c1-10-6-11(2)8-13(7-10)24-9-12(3)20-16-22-14(17(4,5)18)21-15(19)23-16/h6-8,12,20H,9,19H2,1-5H3
48 atoms
F  1.756785 -3.303999 3.153438
O  -1.659979 1.669972 -0.380136
N  0.025138 -0.617853 -0.306212
N  1.149808 -2.235368 0.882261
N  2.629976 -3.652277 -0.274786
N  1.442578 -1.978748 -1.455277
N  2.880151 -3.38918 -2.531002
C  -0.758459 -0.173747 0.829661
C  -0.924904 1.334193 0.782743
C  2.355839 -3.974467 2.086135
C  -2.089327 -0.911146 0.925409
C  2.020467 -3.220428 0.813167
C  0.892156 -1.636892 -0.291341
C  -1.942137 2.96812 -0.629146
C  1.764193 -5.373199 2.030269
C  3.854002 -3.997316 2.331531
C  -1.563003 4.018729 0.193625
C  -2.666135 3.218681 -1.797956
C  -1.909103 5.329546 -0.148046
C  -3.013747 4.512975 -2.144249
C  -2.628079 5.56542 -1.308624
C  2.302738 -2.989438 -1.395281
C  -1.495153 6.459264 0.748851
C  -3.796889 4.793938 -3.392874
H  -0.178922 -0.379739 1.73014
H  -1.452731 1.661418 1.685091
H  0.05801 1.818009 0.771572
H  -0.214545 -0.256945 -1.217759
H  -1.921624 -1.978443 1.066591
H  -2.690858 -0.782265 0.025711
H  -2.670477 -0.553063 1.776169
H  0.683022 -5.341601 1.887025
H  1.972023 -5.910392 2.95686
H  2.197716 -5.939852 1.208112
H  4.270439 -2.989951 2.371151
H  4.362813 -4.540301 1.538038
H  4.073906 -4.496505 3.275888
H  -2.954176 2.386186 -2.430114
H  -2.897113 6.582278 -1.573473
H  -1.846919 7.419295 0.372692
H  -1.892421 6.33238 1.757601
H  -0.408962 6.517209 0.840148
H  -3.267928 5.492232 -4.043832
H  -4.761946 5.24812 -3.160164
H  3.580428 -4.109985 -2.513545
H  2.715033 -2.889438 -3.387552
H  -1.001674 3.848792 1.103918
H  -3.987718 3.886068 -3.963945
elementType: F O N C H
totalener: -1111.29884469 hartree
nucrepener: 2008.83206518 hartree
electener: -3120.13090987 hartree
oneelecener: -5504.86854497 hartree
twoeener: 2384.73763510 hartree
cpcmener: -0.03069156 hartree
kineticenergy: 1106.43376291 hartree
xcener: -106.876731142402 hartree
chargesum: -0.0000000
charge: -0.263908 -0.336394 -0.199917 -0.414321 -0.459327 -0.440551 -0.260016 0.111346 0.022612 0.338613 -0.296566 0.226314 0.404193 0.343425 -0.312884 -0.301251 -0.241114 -0.301048 -0.016950 0.041817 -0.250607 0.344096 -0.216151 -0.211761 0.076640 0.108232 0.114288 0.158728 0.097650 0.091846 0.092333 0.110187 0.103044 0.096283 0.108568 0.092797 0.102083 0.125254 0.122022 0.089006 0.102485 0.102665 0.101534 0.102641 0.189966 0.189577 0.121407 0.091116
qa: -0.2639 -0.3364 -0.1999 -0.4143 -0.4593 -0.4406 -0.2600 0.1113 0.0226 0.3386 -0.2966 0.2263 0.4042 0.3434 -0.3129 -0.3013 -0.2411 -0.3010 -0.0170 0.0418 -0.2506 0.3441 -0.2162 -0.2118 0.0766 0.1082 0.1143 0.1587 0.0977 0.0918 0.0923 0.1102 0.1030 0.0963 0.1086 0.0928 0.1021 0.1253 0.1220 0.0890 0.1025 0.1027 0.1015 0.1026 0.1900 0.1896 0.1214 0.0911
va: 1.0064 2.0644 3.2171 2.9980 2.9482 2.9743 3.2045 3.8731 3.8355 3.9040 3.9577 4.0447 4.2061 3.7701 3.9294 3.9293 3.8745 4.0214 3.8288 3.7415 3.9360 4.3467 3.9016 3.8971 1.0412 0.9924 0.9993 1.0420 1.0090 1.0118 1.0069 1.0076 1.0051 1.0148 1.0058 1.0190 1.0065 1.0184 1.0115 1.0060 0.9949 0.9947 0.9955 0.9948 1.0116 1.0114 1.0195 1.0062
dispcorr: -0.019807136 hartree
energy: -1111.318651827414
dipole: -9.14390 9.53885 0.39495 13.36160 -13.12762 0.23398 -0.99366 0.06861 -0.92505
magnitude: 1.03269 au
magnitude: 2.62489 debye
