program: Orca
programVersion: 5.0.2
elementType: F O N N N N N C C C C C C C C C C C C C C C C C H H H H H H H H H H H H H H H H H H H H H H H H
charge: 0
multiplicity: 1
keywords: wb97x-d3
keywords: def2-TZVPP
keywords: def2/J RIJCOSX
keywords: DEFGRID2
keywords: scfconv7
keywords: smallprint printgap noloewdin
keywords: NOSOSCF
formula: C17H24FN5O
InChI: InChI=1/C17H24FN5O/c1-10-6-11(2)8-13(7-10)24-9-12(3)20-16-22-14(17(4,5)18)21-15(19)23-16/h6-8,12,20H,9,19H2,1-5H3
48 atoms
F  2.449005 -1.927176 2.560854
O  -1.982637 1.20309 0.054409
N  -1.453215 -1.58242 -0.062756
N  0.667394 -2.053447 0.690038
N  2.179621 -3.084287 -0.789388
N  -0.006636 -2.556385 -1.526554
N  1.506733 -3.540558 -2.925497
C  -1.855278 -0.89833 1.150251
C  -1.384495 0.548921 1.156146
C  2.900653 -2.649408 1.456216
C  -3.361151 -1.023259 1.321333
C  1.834726 -2.577446 0.379213
C  -0.232637 -2.073514 -0.306153
C  -1.669949 2.488828 -0.205093
C  3.087312 -4.092956 1.892498
C  4.200093 -2.016566 0.993883
C  -2.287384 3.046087 -1.328498
C  -0.80167 3.252091 0.562054
C  -2.038092 4.358777 -1.688156
C  -0.543014 4.57932 0.206016
C  -1.159812 5.120057 -0.910877
C  1.213951 -3.044052 -1.720752
C  -2.695401 4.964398 -2.89277
C  0.390475 5.399551 1.046545
H  -1.365561 -1.381939 1.996731
H  -1.673525 1.024104 2.100774
H  -0.292196 0.584261 1.085562
H  -2.084057 -1.554148 -0.848925
H  -3.653688 -2.069005 1.415226
H  -3.907932 -0.597102 0.479312
H  -3.684071 -0.504994 2.223533
H  2.151086 -4.525194 2.24884
H  3.822161 -4.155347 2.696534
H  3.444661 -4.700682 1.062795
H  4.61418 -2.560633 0.148078
H  4.934736 -2.036902 1.799998
H  4.053991 -0.97924 0.689376
H  -0.314685 2.842511 1.438453
H  -0.958732 6.149378 -1.18764
H  -3.276447 5.848757 -2.625067
H  -1.955434 5.283158 -3.629319
H  -3.368491 4.261588 -3.38276
H  1.360582 4.91208 1.157845
H  -0.007765 5.546625 2.052512
H  2.443457 -3.842799 -3.130264
H  0.845427 -3.461171 -3.678642
H  -2.963762 2.435138 -1.915906
H  0.561366 6.384272 0.612762
elementType: F O N C H
totalener: -1111.29887472 hartree
nucrepener: 2063.58785223 hartree
electener: -3174.88672695 hartree
oneelecener: -5614.69190734 hartree
twoeener: 2439.80518038 hartree
cpcmener: -0.03104346 hartree
kineticenergy: 1106.44773149 hartree
xcener: -106.879386752967 hartree
chargesum: 0.0000000
charge: -0.264027 -0.330626 -0.209536 -0.421665 -0.461084 -0.438491 -0.259545 0.156688 -0.018352 0.336218 -0.289244 0.231815 0.400580 0.336829 -0.312177 -0.300431 -0.298215 -0.244947 0.040922 -0.018704 -0.251037 0.345511 -0.211906 -0.217344 0.078149 0.119193 0.108141 0.161254 0.104203 0.091845 0.090036 0.109808 0.103006 0.096219 0.092000 0.102552 0.108767 0.120445 0.122503 0.101364 0.101902 0.091247 0.101949 0.103226 0.189612 0.189758 0.121784 0.089810
qa: -0.2640 -0.3306 -0.2095 -0.4217 -0.4611 -0.4385 -0.2595 0.1567 -0.0184 0.3362 -0.2892 0.2318 0.4006 0.3368 -0.3122 -0.3004 -0.2982 -0.2449 0.0409 -0.0187 -0.2510 0.3455 -0.2119 -0.2173 0.0781 0.1192 0.1081 0.1613 0.1042 0.0918 0.0900 0.1098 0.1030 0.0962 0.0920 0.1026 0.1088 0.1204 0.1225 0.1014 0.1019 0.0912 0.1019 0.1032 0.1896 0.1898 0.1218 0.0898
va: 1.0060 2.0663 3.2015 2.9828 2.9550 2.9805 3.2049 3.8589 3.8007 3.9116 3.9435 4.0267 4.2142 3.7881 3.9320 3.9303 4.0165 3.8677 3.7419 3.8194 3.9343 4.3434 3.8973 3.9009 1.0339 0.9944 1.0063 1.0323 1.0066 1.0092 1.0057 1.0076 1.0054 1.0144 1.0196 1.0061 1.0057 1.0209 1.0111 0.9955 0.9949 1.0061 0.9956 0.9942 1.0116 1.0113 1.0209 1.0057
dispcorr: -0.020151893 hartree
energy: -1111.319026616179
dipole: -3.55541 3.59626 0.04086 13.78127 -14.05267 -0.27140 0.16884 -1.06573 -0.89688
magnitude: 0.93794 au
magnitude: 2.38405 debye
