program: Orca
programVersion: 5.0.2
elementType: F O N N N N N C C C C C C C C C C C C C C C C C H H H H H H H H H H H H H H H H H H H H H H H H
charge: 0
multiplicity: 1
keywords: wb97x-d3
keywords: def2-TZVPP
keywords: def2/J RIJCOSX
keywords: DEFGRID2
keywords: scfconv7
keywords: smallprint printgap noloewdin
keywords: NOSOSCF
formula: C17H24FN5O
InChI: InChI=1/C17H24FN5O/c1-10-6-11(2)8-13(7-10)24-9-12(3)20-16-22-14(17(4,5)18)21-15(19)23-16/h6-8,12,20H,9,19H2,1-5H3
48 atoms
F  1.931107 -2.770975 3.150389
O  -1.879151 1.461761 -0.387531
N  -0.673413 -1.104897 -0.401291
N  0.914075 -2.21167 0.848212
N  2.589843 -3.414611 -0.284706
N  0.934716 -2.258218 -1.520494
N  2.582689 -3.438076 -2.570984
C  -1.398973 -0.576327 0.734991
C  -1.28692 0.939425 0.786507
C  2.598687 -3.427111 2.115463
C  -2.843598 -1.059381 0.721238
C  1.985753 -2.974134 0.803321
C  0.417975 -1.876392 -0.35322
C  -1.876011 2.795238 -0.597742
C  2.385376 -4.920357 2.298806
C  4.065173 -3.044175 2.197534
C  -1.346221 3.723773 0.286409
C  -2.456078 3.219502 -1.796511
C  -1.396897 5.086506 -0.023529
C  -2.5127 4.565992 -2.110848
C  -1.979723 5.495354 -1.212414
C  2.01927 -3.020693 -1.434217
C  -0.817273 6.0830 0.936933
C  -3.133803 5.031799 -3.394493
H  -0.909505 -0.947664 1.634751
H  -1.797712 1.312093 1.681593
H  -0.233322 1.2319 0.853167
H  -1.023007 -0.891523 -1.323294
H  -2.882144 -2.146038 0.79305
H  -3.365785 -0.766205 -0.190365
H  -3.394503 -0.64966 1.568337
H  2.789136 -5.247231 3.258003
H  2.891669 -5.478496 1.513106
H  1.325758 -5.178594 2.266529
H  4.205709 -1.969383 2.075411
H  4.637819 -3.548705 1.422463
H  4.47629 -3.336606 3.164455
H  -2.862295 2.479612 -2.477086
H  -2.021787 6.552372 -1.45209
H  -0.916784 7.102593 0.566054
H  -1.311644 6.034054 1.908946
H  0.24386 5.895559 1.11115
H  -3.967947 5.71063 -3.20765
H  -3.510793 4.199248 -3.987564
H  3.445695 -3.953136 -2.546255
H  2.23635 -3.111384 -3.456658
H  -0.889653 3.417388 1.219525
H  -2.413689 5.576591 -4.007701
elementType: F O N C H
totalener: -1111.29879112 hartree
nucrepener: 2021.66938723 hartree
electener: -3132.96817834 hartree
oneelecener: -5530.62716828 hartree
twoeener: 2397.65898993 hartree
cpcmener: -0.03070113 hartree
kineticenergy: 1106.43985094 hartree
xcener: -106.878187830713 hartree
chargesum: 0.0000000
charge: -0.263915 -0.333985 -0.200128 -0.409424 -0.460831 -0.441606 -0.259406 0.115387 0.004051 0.340391 -0.283381 0.225360 0.401157 0.337965 -0.311765 -0.302385 -0.241544 -0.298708 -0.015883 0.042438 -0.253212 0.345167 -0.216161 -0.211947 0.082031 0.108836 0.111305 0.159856 0.099540 0.092652 0.090069 0.102793 0.095760 0.109519 0.108706 0.092422 0.102346 0.124104 0.122497 0.089352 0.102381 0.102421 0.101915 0.091228 0.189789 0.189297 0.121699 0.101846
qa: -0.2639 -0.3340 -0.2001 -0.4094 -0.4608 -0.4416 -0.2594 0.1154 0.0041 0.3404 -0.2834 0.2254 0.4012 0.3380 -0.3118 -0.3024 -0.2415 -0.2987 -0.0159 0.0424 -0.2532 0.3452 -0.2162 -0.2119 0.0820 0.1088 0.1113 0.1599 0.0995 0.0927 0.0901 0.1028 0.0958 0.1095 0.1087 0.0924 0.1023 0.1241 0.1225 0.0894 0.1024 0.1024 0.1019 0.0912 0.1898 0.1893 0.1217 0.1018
va: 1.0062 2.0700 3.2128 3.0076 2.9466 2.9711 3.2035 3.8647 3.8800 3.8941 3.9607 4.0534 4.2226 3.7857 3.9290 3.9295 3.8662 4.0144 3.8246 3.7403 3.9349 4.3451 3.9012 3.8971 1.0512 0.9932 0.9968 1.0373 1.0064 1.0089 1.0063 1.0054 1.0150 1.0077 1.0059 1.0191 1.0061 1.0192 1.0113 1.0059 0.9949 0.9949 0.9951 1.0062 1.0114 1.0114 1.0196 0.9950
dispcorr: -0.019742108 hartree
energy: -1111.318533223726
dipole: -6.65740 7.00518 0.34777 13.93555 -13.89000 0.04555 -0.73974 -0.16194 -0.90167
magnitude: 0.96749 au
magnitude: 2.45917 debye
