program: Gaussian 09
title: 000055435
version: EM64L-G09RevD.01
frameworkgroup: C1[X(C19H32O3Si)]
method: RPBEPBE
basis: SDD
operation: Freq
keyword: #p
keyword: freq=noraman
keyword: PBEPBE/SDD
title: #p freq=noraman PBEPBE/SDD
converged: YES YES NO NO
title: Mulliken charges:
elementType: Si O O O C C C C C C C C C C C C C C C C C C C H H H H H H H H H H H H H H H H H H H H H H H H H H H H H H H H
charge: 1.428427 -0.610434 -0.274599 -0.239850 -0.758849 -0.783024 -0.767098 -0.256895 0.220228 -0.692218 -0.673470 -0.669868 0.353191 0.309341 0.233368 -0.614629 -0.624892 0.484550 -0.836583 -0.874805 -0.817399 -0.265382 -0.660666 0.261682 0.220364 0.221138 0.244146 0.232297 0.220210 0.239567 0.219999 0.214475 0.225273 0.214982 0.250381 0.212968 0.215351 0.239345 0.217515 0.233795 0.233420 0.206205 0.252544 0.267521 0.259235 0.230618 0.227728 0.233978 0.221822 0.223739 0.220013 0.234266 0.215134 0.250764 0.231079
chargesum: 0.00000
title: Mulliken charges with hydrogens summed into heavy atoms:
elementType: Si O O O C C C C C C C C C C C C C C C C C C C
charge: 1.428427 -0.610434 -0.274599 -0.239850 -0.276803 -0.317740 -0.314591 -0.017328 0.220228 -0.032471 0.004861 0.002343 0.353191 0.309341 0.233368 -0.380834 -0.391472 0.484550 -0.110313 -0.157224 -0.137859 0.188897 0.036311
polarizability: 2.77732428e+02 2.16114652e+01 2.16450807e+02 -7.55327558e+00 8.26823876e+00 2.28311134e+02
1716.lowfreq: -16.1753 -1.2634 -0.0010 -0.0007 0.0007 4.4724 5.2421 15.7889 22.1154
frequency: -13.2858 15.6350 21.7987 30.4722 36.8046 42.5055 49.6699 55.0189 66.9936 75.6371 81.7252 89.3192 96.9101 115.9602 120.8372 137.9915 151.7733 155.0254 164.5714 181.7863 189.1551 195.0006 202.0197 217.7664 221.6799 226.8239 230.6473 253.4469 269.2147 280.0041 291.0099 317.7880 326.2868 336.6675 365.8415 378.9823 400.6337 454.8470 476.8480 506.8043 526.6173 533.9655 553.0064 563.1215 573.0985 628.9552 649.3386 677.8150 683.7904 702.4170 734.0615 738.7153 757.1345 772.0945 801.9393 814.1175 831.8964 864.5006 889.9914 894.5663 939.2827 954.3482 960.1977 963.8723 981.8966 989.0921 995.3333 998.0956 1008.9982 1015.5954 1016.0894 1023.7461 1028.9127 1033.6855 1038.3864 1045.3973 1049.4162 1052.4587 1060.4060 1089.8923 1102.8268 1143.6101 1155.6078 1208.8845 1228.8710 1232.2321 1238.9622 1244.0769 1247.5159 1252.9217 1255.7556 1274.1867 1278.9217 1312.7915 1335.4715 1354.3384 1374.1430 1391.7764 1394.0257 1394.6675 1394.9300 1395.7856 1398.5897 1403.8313 1414.1161 1436.4527 1438.9855 1441.2703 1442.3146 1458.0293 1462.5321 1466.4347 1472.8956 1474.2015 1477.0175 1480.9796 1482.3894 1483.7529 1484.0316 1486.1737 1487.0838 1488.0388 1489.6902 1497.1752 1587.3918 1616.9690 1640.3852 2965.8610 2965.9553 2969.2720 2972.6106 2973.7099 2975.4255 2977.9175 2979.7836 2986.4162 2990.4136 2993.2102 3017.9136 3027.9880 3033.3710 3037.9187 3047.0566 3053.4072 3061.4718 3063.8683 3064.8833 3066.9493 3071.3688 3079.3346 3080.7427 3081.5095 3082.2185 3088.6035 3091.1291 3092.3056 3110.0863 3114.4175 3118.2096
redmass: 3.6093 1.0148 3.9673 4.0649 3.5032 3.3069 2.5728 2.6595 2.8054 2.6909 3.4894 4.5712 3.2500 2.9854 2.0702 1.3270 1.7750 1.6504 2.2293 2.4947 1.9739 1.7031 1.2114 1.3480 1.5487 2.2540 1.5388 2.5097 2.6402 2.8700 2.7613 3.1674 3.4106 3.5244 6.0315 4.1383 3.7327 3.8669 3.6677 3.9030 3.0793 4.6120 3.6470 4.1376 3.2615 5.5408 2.2055 2.2204 2.8176 2.3166 1.8536 2.3033 1.8784 3.7057 1.8895 2.1896 3.7281 1.3525 3.5681 1.3258 2.5115 1.1433 3.4354 1.1923 1.3257 1.4935 1.4678 1.6488 2.7443 2.2895 1.8013 1.6771 2.4258 2.4262 2.0247 1.5482 1.6027 1.5925 3.5007 3.1492 2.8514 3.3677 1.6645 1.5716 1.2719 1.2755 1.2367 1.3831 1.5380 1.4085 1.4090 1.3709 1.1187 6.2766 1.4973 1.3121 2.7222 1.1840 1.2278 1.1877 1.2274 1.1852 1.2569 1.2911 2.1718 1.0794 1.0821 1.4628 1.2853 1.0915 1.0461 1.1835 1.0548 1.1014 1.0788 1.0540 1.0479 1.0416 1.0518 1.0560 1.0623 1.0764 1.0448 1.2943 6.8514 5.8183 8.9834 1.0567 1.0402 1.0356 1.0385 1.0375 1.0387 1.0620 1.0556 1.0818 1.0367 1.0363 1.0982 1.0594 1.0987 1.0975 1.0940 1.0949 1.0994 1.1002 1.1000 1.0998 1.0999 1.0978 1.0999 1.0987 1.0997 1.0974 1.0989 1.1035 1.0908 1.0917 1.1056
irintensity: 0.0503 0.4028 0.6145 1.0692 0.1210 0.0822 0.1468 0.0131 0.3158 0.7653 0.3426 0.8328 0.5944 1.5881 0.4552 0.9025 0.7906 1.0135 1.9567 2.6242 5.4950 0.6364 0.7534 0.0942 0.5298 0.0981 0.4889 0.5814 0.9276 2.9016 4.1966 6.8501 11.2701 1.5023 4.9657 7.2646 8.3762 11.3476 3.8272 1.3406 0.1957 0.8444 0.3669 0.4510 10.7424 6.0512 6.0617 2.2798 32.3326 5.6823 58.4155 71.2224 66.8536 100.4450 21.5429 0.3469 15.1236 24.0483 18.1058 0.3266 3.2595 9.3806 0.6686 9.4734 1.3924 18.6803 5.0975 11.4782 36.6285 74.1669 21.4034 7.4395 17.6765 35.2807 60.1330 2.5273 14.7618 20.3644 331.5638 156.8805 61.3858 13.6190 8.2334 4.1511 1.0188 1.8591 1.4553 2.6627 6.0162 10.4359 15.4414 11.0996 1.5048 1.2936 2.9525 1.6129 5.7509 8.0477 27.2503 7.5392 11.5910 6.3629 11.0081 10.9946 3.1678 9.4768 16.9929 10.5134 18.1885 16.6036 15.2891 5.0151 10.9499 12.6439 9.1807 6.8940 6.2860 7.5120 14.0681 0.2940 8.0790 41.4406 1.5694 33.2417 8.4093 25.9885 155.1286 17.5504 34.4650 59.8167 40.6809 26.1568 51.8052 20.3976 14.5504 17.3029 29.1878 17.5251 15.1865 34.7899 11.3754 0.8330 19.3621 23.8894 43.8921 23.9877 76.6696 26.5137 52.2753 22.3023 41.6841 14.0569 19.9347 38.8493 7.6606 0.4616 32.1428 19.6529 29.2666
temp: 298.150 k
press: 1.00000 atm
elementType: 14 8 8 8 6 6 6 6 6 6 6 6 6 6 6 6 6 6 6 6 6 6 6 1 1 1 1 1 1 1 1 1 1 1 1 1 1 1 1 1 1 1 1 1 1 1 1 1 1 1 1 1 1 1 1
symmnumber: 1
zpe: 1224536.5 jmol-1
zpe.correction: 0.466401 hartree
zpe.thermalcorrener: 0.495650 hartree
zpe.thermalcorrenthalpy: 0.496594 hartree
zpe.thermalcorrgfe: 0.403823 hartree
zpe.sumelectzpe: -1256.523983 hartree
zpe.sumelectthermal: -1256.494734 hartree
zpe.sumelectthermalent: -1256.493790 hartree
zpe.sumelectthermalfe: -1256.586561 hartree
dipole: 0.0763 1.1159 2.0653
dipole: 2.3488
quadrupole: -137.3285 -139.9463 -147.6567
quadrupole: -2.0118 1.7066 3.9601
quadrupole: 4.3154 1.6975 -6.0129 -2.0118 1.7066 3.9601
hfenergy: -1256.9903838 hartree
pointgroup: C01 [X(C19H32O3Si1)]
dipole: 0.1787033 0.7009975 0.57496 debye
polarizability: 282.4642187|4.2912811|219.6914292|-12.6471842|13.0561473|220.3387207 unknown
InChI: InChI=1S/C19H32O3Si/c1-8-21-19(20)18(22-23(9-2,10-3)11-4)17-15(6)12-14(5)13-16(17)7/h12-13,18H,8-11H2,1-7H3
charge 0 multiplicity 1
55 atoms
Si 2.730831 -1.058477 0.457252
O  1.047036 -0.83002 -0.032597
O  0.260961 2.709581 -0.298636
O  1.01385 1.296709 -1.997956
C  3.849726 0.304402 -0.299093
C  3.12113 -2.79288 -0.235366
C  2.787588 -0.9937 2.377601
C  0.267811 0.36056 0.215744
C  -1.235276 0.041554 0.23204
C  5.360243 0.064658 -0.032892
C  3.120951 -2.854443 -1.78513
C  1.822922 -1.99895 3.059197
C  -1.833392 -0.7520 -0.796405
C  -2.040934 0.556786 1.293346
C  0.566651 1.455994 -0.842183
C  -3.225272 -1.010256 -0.73166
C  -3.426942 0.269126 1.314398
C  -4.040839 -0.518979 0.313521
C  -1.046064 -1.351329 -1.950598
C  -1.4640 1.419117 2.408466
C  -5.523643 -0.843834 0.370863
C  0.373094 3.885364 -1.219605
C  -0.911427 4.057432 -2.034368
H  3.652193 0.355934 -1.386957
H  3.550029 1.290187 0.112132
H  4.10024 -3.128731 0.162623
H  2.364575 -3.494898 0.167257
H  3.829635 -1.178566 2.71037
H  2.547521 0.039738 2.7048
H  0.539044 0.812027 1.190063
H  5.698597 -0.898196 -0.46048
H  5.590039 0.048954 1.049414
H  5.976903 0.861521 -0.488569
H  3.307745 -3.883485 -2.144851
H  2.149423 -2.52136 -2.191915
H  3.902875 -2.202425 -2.217687
H  1.837361 -1.891351 4.159916
H  0.783117 -1.848077 2.714684
H  2.097488 -3.043916 2.823423
H  -3.681227 -1.615961 -1.52551
H  -4.038422 0.67101 2.132495
H  -1.732514 -1.726643 -2.730011
H  -0.422356 -2.188746 -1.592054
H  -0.349151 -0.628801 -2.406564
H  -0.983029 2.332165 2.012663
H  -2.260765 1.728821 3.106042
H  -0.703747 0.873584 3.002462
H  -5.704411 -1.776688 0.940196
H  -6.096201 -0.040812 0.868133
H  -5.945183 -0.990573 -0.639349
H  0.549625 4.73203 -0.53694
H  1.249855 3.732607 -1.873571
H  -0.845651 4.977302 -2.644887
H  -1.06232 3.202739 -2.714788
H  -1.789596 4.142693 -1.371581
