program: Orca
programVersion: 5.0.2
elementType: F O N N N N N C C C C C C C C C C C C C C C C C H H H H H H H H H H H H H H H H H H H H H H H H
charge: 0
multiplicity: 1
keywords: wb97x-d3
keywords: def2-TZVPP
keywords: def2/J RIJCOSX
keywords: DEFGRID2
keywords: scfconv7
keywords: smallprint printgap noloewdin
keywords: NOSOSCF
formula: C17H24FN5O
InChI: InChI=1/C17H24FN5O/c1-10-6-11(2)8-13(7-10)24-9-12(3)20-16-22-14(17(4,5)18)21-15(19)23-16/h6-8,12,20H,9,19H2,1-5H3
48 atoms
F  4.093797 -2.019967 0.095638
O  -3.017202 1.542256 -0.113652
N  -1.688739 -1.870791 -0.444524
N  0.558507 -1.674996 0.019576
N  2.043411 -3.258428 -0.887979
N  -0.281752 -3.426974 -1.327762
N  1.199554 -4.932395 -2.193306
C  -2.078605 -0.683243 0.283484
C  -2.696633 0.302605 -0.712233
C  2.888204 -1.491067 0.558472
C  -3.033199 -1.028222 1.416959
C  1.758967 -2.194588 -0.171148
C  -0.438762 -2.330618 -0.586094
C  -2.052729 2.473605 0.082174
C  2.896646 -0.001505 0.269108
C  2.791063 -1.785915 2.045927
C  -2.451178 3.601953 0.798968
C  -0.749467 2.38246 -0.395744
C  -1.56453 4.642423 1.030952
C  0.148049 3.427962 -0.175027
C  -0.264995 4.547665 0.534308
C  0.971596 -3.846463 -1.452617
C  -1.990607 5.855737 1.803701
C  1.555178 3.334374 -0.689168
H  -1.168453 -0.252304 0.700743
H  -2.043763 0.43116 -1.579977
H  -3.644366 -0.095738 -1.082138
H  -2.414682 -2.410853 -0.892708
H  -3.947562 -1.489397 1.037574
H  -3.314633 -0.138873 1.980093
H  -2.566103 -1.725532 2.112607
H  2.948014 0.19728 -0.801905
H  3.758065 0.467504 0.74623
H  1.997662 0.468897 0.659985
H  3.624749 -1.327458 2.57945
H  2.808225 -2.859379 2.239791
H  1.865928 -1.383399 2.454518
H  -0.40586 1.516601 -0.946963
H  0.43295 5.360435 0.704753
H  -3.035379 5.796098 2.105872
H  -1.390347 5.978815 2.706893
H  -1.865803 6.765218 1.213782
H  2.257848 3.119827 0.118726
H  1.87315 4.271864 -1.146336
H  2.13287 -5.293705 -2.285494
H  0.434978 -5.429149 -2.616395
H  -3.468653 3.659653 1.168243
H  1.660969 2.547375 -1.434756
elementType: F O N C H
totalener: -1111.29571669 hartree
nucrepener: 2110.32317530 hartree
electener: -3221.61889199 hartree
oneelecener: -5707.37454438 hartree
twoeener: 2485.75565238 hartree
cpcmener: -0.03294800 hartree
kineticenergy: 1106.44171603 hartree
xcener: -106.879649576461 hartree
chargesum: -0.0000000
charge: -0.263176 -0.339249 -0.199788 -0.468903 -0.391223 -0.439613 -0.248354 0.080217 0.009527 0.353630 -0.276824 0.213307 0.389707 0.329991 -0.316240 -0.313812 -0.301755 -0.240379 0.046690 0.031271 -0.274015 0.352442 -0.212746 -0.258702 0.091806 0.109039 0.126564 0.159509 0.090490 0.091235 0.097920 0.112292 0.109229 0.085136 0.103985 0.110022 0.096842 0.121059 0.122156 0.091423 0.102202 0.101425 0.107126 0.111621 0.191426 0.189242 0.119627 0.096620
qa: -0.2632 -0.3392 -0.1998 -0.4689 -0.3912 -0.4396 -0.2484 0.0802 0.0095 0.3536 -0.2768 0.2133 0.3897 0.3300 -0.3162 -0.3138 -0.3018 -0.2404 0.0467 0.0313 -0.2740 0.3524 -0.2127 -0.2587 0.0918 0.1090 0.1266 0.1595 0.0905 0.0912 0.0979 0.1123 0.1092 0.0851 0.1040 0.1100 0.0968 0.1211 0.1222 0.0914 0.1022 0.1014 0.1071 0.1116 0.1914 0.1892 0.1196 0.0966
va: 1.0087 2.0699 3.1927 2.9476 3.0187 2.9752 3.2019 3.7713 3.8803 3.9181 3.9537 4.0543 4.2386 3.7933 3.9488 3.9296 4.0439 3.8303 3.7468 3.6862 3.9671 4.3351 3.8960 3.9128 1.0383 1.0047 0.9940 1.0313 1.0039 1.0139 1.0073 1.0041 1.0077 1.0067 1.0051 1.0087 1.0122 1.0217 1.0095 1.0060 0.9951 0.9957 0.9881 1.0004 1.0104 1.0114 1.0238 1.0012
dispcorr: -0.022969651 hartree
energy: -1111.318686340283
dipole: -7.07486 5.98940 -1.08547 18.93364 -19.35167 -0.41803 9.16189 -9.36344 -0.20155
magnitude: 1.18051 au
magnitude: 3.00062 debye
